BDBM50262553 (9S)-9-(2-Hydroxy-4,4-dimethyl-6-oxo-1-cyclohexen-1-yl)-3,3-dimethyl-2,3,4,9-tetrahydro-1H-xanthen-1-one::CHEMBL508770
SMILES: CC1(C)CC(=O)C([C@H]2C3=C(CC(C)(C)CC3=O)Oc3ccccc23)C(=O)C1
InChI Key: InChIKey=XQDXIHYKAGHZRX-IBGZPJMESA-N
Data: 1 KI  1 IC50
Activity Spreadsheet -- Enzyme Inhibition Constant Data from BindingDB
Found 2 hits for monomerid = 50262553
Trg + Lig
Ki
nM
ΔG°
kcal/mole
IC50
nM
Kd
nM
EC50/IC50
nM
koff
s-1
kon
M-1s-1
pHTemp
°C
Neuropeptide Y receptor type 5 ( NPY Y5)
(Homo sapiens (Human))
BDBM50262553
((9S)-9-(2-Hydroxy-4,4-dimethyl-6-oxo-1-cyclohexen-...)
Show SMILES CC1(C)CC(=O)C([C@H]2C3=C(CC(C)(C)CC3=O)Oc3ccccc23)C(=O)C1 |r,t:8|
Show InChI InChI=1S/C23H26O4/c1-22(2)9-14(24)20(15(25)10-22)19-13-7-5-6-8-17(13)27-18-12-23(3,4)11-16(26)21(18)19/h5-8,19-20H,9-12H2,1-4H3/t19-/m0/s1
14n/an/an/an/an/an/an/an/a
Tsukuba Research Institute
Curated by ChEMBL
Assay Description
Displacement of [125I]PYY from human recombinant neuropeptide Y5 receptor expressed in thymidine kinase deficient human LM cells
J Med Chem 51: 4765-70 (2008)
Article DOI: 10.1021/jm8003587
BindingDB Entry DOI: 10.7270/Q2J96664
Neuropeptide Y receptor type 5 ( NPY Y5)
(Homo sapiens (Human))
BDBM50262553
((9S)-9-(2-Hydroxy-4,4-dimethyl-6-oxo-1-cyclohexen-...)
Show SMILES CC1(C)CC(=O)C([C@H]2C3=C(CC(C)(C)CC3=O)Oc3ccccc23)C(=O)C1 |r,t:8|
Show InChI InChI=1S/C23H26O4/c1-22(2)9-14(24)20(15(25)10-22)19-13-7-5-6-8-17(13)27-18-12-23(3,4)11-16(26)21(18)19/h5-8,19-20H,9-12H2,1-4H3/t19-/m0/s1
n/an/a 34n/an/an/an/an/an/a
Tsukuba Research Institute
Curated by ChEMBL
Assay Description
Antagonist activity at human recombinant neuropeptide Y5 receptor expressed in CHO cells coexpressing Gqi5 assessed as inhibition of neuropeptide Y-i...
J Med Chem 51: 4765-70 (2008)
Article DOI: 10.1021/jm8003587
BindingDB Entry DOI: 10.7270/Q2J96664