BDBM50262613 (4-(3-chlorophenyl)piperazin-1-yl)(1-(3-methoxyphenyl)-2-p-tolyl-1H-imidazol-4-yl)methanone::CHEMBL478604
SMILES: COc1cccc(c1)-n1cc(nc1-c1ccc(C)cc1)C(=O)N1CCN(CC1)c1cccc(Cl)c1
InChI Key: InChIKey=NCMZUUDIJSSYOQ-UHFFFAOYSA-N
Data: 1 IC50  1 EC50
Activity Spreadsheet -- Enzyme Inhibition Constant Data from BindingDB
Found 2 hits for monomerid = 50262613
Trg + Lig
Ki
nM
ΔG°
kcal/mole
IC50
nM
Kd
nM
EC50/IC50
nM
koff
s-1
kon
M-1s-1
pHTemp
°C
Cholecystokinin receptor
(Homo sapiens (Human))
BDBM50262613
((4-(3-chlorophenyl)piperazin-1-yl)(1-(3-methoxyphe...)
Show SMILES COc1cccc(c1)-n1cc(nc1-c1ccc(C)cc1)C(=O)N1CCN(CC1)c1cccc(Cl)c1
Show InChI InChI=1S/C28H27ClN4O2/c1-20-9-11-21(12-10-20)27-30-26(19-33(27)24-7-4-8-25(18-24)35-2)28(34)32-15-13-31(14-16-32)23-6-3-5-22(29)17-23/h3-12,17-19H,13-16H2,1-2H3
Reactome pathway
n/an/a 14n/an/an/an/an/an/a
Merck Research Laboratories
Curated by ChEMBL
Assay Description
Inhibition of human CCK1 receptor
Bioorg Med Chem Lett 18: 4393-6 (2008)
Article DOI: 10.1016/j.bmcl.2008.06.057
BindingDB Entry DOI: 10.7270/Q2HH6JW0
Cholecystokinin receptor
(Homo sapiens (Human))
BDBM50262613
((4-(3-chlorophenyl)piperazin-1-yl)(1-(3-methoxyphe...)
Show SMILES COc1cccc(c1)-n1cc(nc1-c1ccc(C)cc1)C(=O)N1CCN(CC1)c1cccc(Cl)c1
Show InChI InChI=1S/C28H27ClN4O2/c1-20-9-11-21(12-10-20)27-30-26(19-33(27)24-7-4-8-25(18-24)35-2)28(34)32-15-13-31(14-16-32)23-6-3-5-22(29)17-23/h3-12,17-19H,13-16H2,1-2H3
Reactome pathway
n/an/an/an/a 74n/an/an/an/a
Merck Research Laboratories
Curated by ChEMBL
Assay Description
Agonist activity against human CCK1 receptor
Bioorg Med Chem Lett 18: 4393-6 (2008)
Article DOI: 10.1016/j.bmcl.2008.06.057
BindingDB Entry DOI: 10.7270/Q2HH6JW0