BDBM50262618 6-Methyl-biphenyl-3,4'-dicarboxylic acid 4'-cyclopropylmethyl-amide 3-phenylamide::CHEMBL516264
SMILES: Cc1ccc(cc1-c1ccc(cc1)C(=O)NCC1CC1)C(=O)Nc1ccccc1
InChI Key: InChIKey=DTXCRJOBJJRLSM-UHFFFAOYSA-N
Data: 2 KI  1 IC50
Activity Spreadsheet -- Enzyme Inhibition Constant Data from BindingDB
Found 3 hits for monomerid = 50262618
Trg + Lig
Ki
nM
ΔG°
kcal/mole
IC50
nM
Kd
nM
EC50/IC50
nM
koff
s-1
kon
M-1s-1
pHTemp
°C
Mitogen-activated protein kinase 14
(Homo sapiens (Human))
BDBM50262618
(6-Methyl-biphenyl-3,4'-dicarboxylic acid 4'-cyclop...)
Show SMILES Cc1ccc(cc1-c1ccc(cc1)C(=O)NCC1CC1)C(=O)Nc1ccccc1
Show InChI InChI=1S/C25H24N2O2/c1-17-7-10-21(25(29)27-22-5-3-2-4-6-22)15-23(17)19-11-13-20(14-12-19)24(28)26-16-18-8-9-18/h2-7,10-15,18H,8-9,16H2,1H3,(H,26,28)(H,27,29)
NCI pathway
Reactome pathway
70n/an/an/an/an/an/an/an/a
GlaxoSmithKline R&D
Curated by ChEMBL
Assay Description
Displacement of rhodamine-green labelled (2-(6-amino-3-imino-3H-xanthen-9-yl)-5-{[({4-[4-(4-Cl-3-hydroxyphenyl)-5-(4-pyridinyl)-1H-imidazol-2yl]pheny...
Bioorg Med Chem Lett 18: 4428-32 (2008)
Article DOI: 10.1016/j.bmcl.2008.06.048
BindingDB Entry DOI: 10.7270/Q2CR5T5P
Mitogen-activated protein kinase 14
(Homo sapiens (Human))
BDBM50262618
(6-Methyl-biphenyl-3,4'-dicarboxylic acid 4'-cyclop...)
Show SMILES Cc1ccc(cc1-c1ccc(cc1)C(=O)NCC1CC1)C(=O)Nc1ccccc1
Show InChI InChI=1S/C25H24N2O2/c1-17-7-10-21(25(29)27-22-5-3-2-4-6-22)15-23(17)19-11-13-20(14-12-19)24(28)26-16-18-8-9-18/h2-7,10-15,18H,8-9,16H2,1H3,(H,26,28)(H,27,29)
NCI pathway
Reactome pathway
73n/an/an/an/an/an/an/an/a
GlaxoSmithKline R&D
Curated by ChEMBL
Assay Description
Displacement of rhodamine-green labeled (2-(6-amino-3-imino-3H-xanthen-9-yl)-5-{[({4-[4-(4-Cl-3-hydroxyphenyl)-5-(4-pyridinyl)-1H-imidazol-2yl]phenyl...
Bioorg Med Chem Lett 18: 4433-7 (2008)
Article DOI: 10.1016/j.bmcl.2008.06.028
BindingDB Entry DOI: 10.7270/Q2JH3M0B
Mitogen-activated protein kinase 14
(Homo sapiens (Human))
BDBM50262618
(6-Methyl-biphenyl-3,4'-dicarboxylic acid 4'-cyclop...)
Show SMILES Cc1ccc(cc1-c1ccc(cc1)C(=O)NCC1CC1)C(=O)Nc1ccccc1
Show InChI InChI=1S/C25H24N2O2/c1-17-7-10-21(25(29)27-22-5-3-2-4-6-22)15-23(17)19-11-13-20(14-12-19)24(28)26-16-18-8-9-18/h2-7,10-15,18H,8-9,16H2,1H3,(H,26,28)(H,27,29)
NCI pathway
Reactome pathway
n/an/a 460n/an/an/an/an/an/a
GlaxoSmithKline R&D
Curated by ChEMBL
Assay Description
Displacement of rhodamine-green labelled (2-(6-amino-3-imino-3H-xanthen-9-yl)-5-{[({4-[4-(4-Cl-3-hydroxyphenyl)-5-(4-pyridinyl)-1H-imidazol-2yl]pheny...
Bioorg Med Chem Lett 18: 4428-32 (2008)
Article DOI: 10.1016/j.bmcl.2008.06.048
BindingDB Entry DOI: 10.7270/Q2CR5T5P