BDBM50262626 CHEMBL515936::Ethanesulfonic acid biphenyl-2-ylmethyl-(S)-pyrrolidin-3-yl-amide
SMILES: CCS(=O)(=O)N(Cc1ccccc1-c1ccccc1)[C@H]1CCNC1
InChI Key: InChIKey=JTFGLXWULCGHRY-SFHVURJKSA-N
Data: 3 KI  1 IC50
Activity Spreadsheet -- Enzyme Inhibition Constant Data from BindingDB
Found 4 hits for monomerid = 50262626
Trg + Lig
Ki
nM
ΔG°
kcal/mole
IC50
nM
Kd
nM
EC50/IC50
nM
koff
s-1
kon
M-1s-1
pHTemp
°C
Sodium-dependent noradrenaline transporter
(Homo sapiens (Human))
BDBM50262626
(CHEMBL515936 | Ethanesulfonic acid biphenyl-2-ylme...)
Show SMILES CCS(=O)(=O)N(Cc1ccccc1-c1ccccc1)[C@H]1CCNC1 |r|
Show InChI InChI=1S/C19H24N2O2S/c1-2-24(22,23)21(18-12-13-20-14-18)15-17-10-6-7-11-19(17)16-8-4-3-5-9-16/h3-11,18,20H,2,12-15H2,1H3/t18-/m0/s1
Reactome pathway
5n/an/an/an/an/an/an/an/a
Pfizer Global Research and Development
Curated by ChEMBL
Assay Description
Inhibition of [3H]nisoxetine reuptake at human NET expressed in HEK293 cells by SPA
Bioorg Med Chem Lett 18: 4355-9 (2008)
Article DOI: 10.1016/j.bmcl.2008.06.071
BindingDB Entry DOI: 10.7270/Q2GH9HRM
Sodium-dependent dopamine transporter
(Homo sapiens (Human))
BDBM50262626
(CHEMBL515936 | Ethanesulfonic acid biphenyl-2-ylme...)
Show SMILES CCS(=O)(=O)N(Cc1ccccc1-c1ccccc1)[C@H]1CCNC1 |r|
Show InChI InChI=1S/C19H24N2O2S/c1-2-24(22,23)21(18-12-13-20-14-18)15-17-10-6-7-11-19(17)16-8-4-3-5-9-16/h3-11,18,20H,2,12-15H2,1H3/t18-/m0/s1
NCI pathway
Reactome pathway
2.76E+3n/an/an/an/an/an/an/an/a
Pfizer Global Research and Development
Curated by ChEMBL
Assay Description
Inhibition of [3H]dopamine reuptake at human DAT expressed in HEK293 cells by SPA
Bioorg Med Chem Lett 18: 4355-9 (2008)
Article DOI: 10.1016/j.bmcl.2008.06.071
BindingDB Entry DOI: 10.7270/Q2GH9HRM
Sodium-dependent serotonin transporter
(Homo sapiens (Human))
BDBM50262626
(CHEMBL515936 | Ethanesulfonic acid biphenyl-2-ylme...)
Show SMILES CCS(=O)(=O)N(Cc1ccccc1-c1ccccc1)[C@H]1CCNC1 |r|
Show InChI InChI=1S/C19H24N2O2S/c1-2-24(22,23)21(18-12-13-20-14-18)15-17-10-6-7-11-19(17)16-8-4-3-5-9-16/h3-11,18,20H,2,12-15H2,1H3/t18-/m0/s1
5.62E+3n/an/an/an/an/an/an/an/a
Pfizer Global Research and Development
Curated by ChEMBL
Assay Description
Inhibition of [3H]citalopram uptake at human 5HTT expressed in HEK293 cells by SPA
Bioorg Med Chem Lett 18: 4355-9 (2008)
Article DOI: 10.1016/j.bmcl.2008.06.071
BindingDB Entry DOI: 10.7270/Q2GH9HRM
Cytochrome P450 2D6
(Homo sapiens (Human))
BDBM50262626
(CHEMBL515936 | Ethanesulfonic acid biphenyl-2-ylme...)
Show SMILES CCS(=O)(=O)N(Cc1ccccc1-c1ccccc1)[C@H]1CCNC1 |r|
Show InChI InChI=1S/C19H24N2O2S/c1-2-24(22,23)21(18-12-13-20-14-18)15-17-10-6-7-11-19(17)16-8-4-3-5-9-16/h3-11,18,20H,2,12-15H2,1H3/t18-/m0/s1
n/an/a 1.89E+3n/an/an/an/an/an/a
Pfizer Global Research and Development
Curated by ChEMBL
Assay Description
Inhibition of CYP2D6 (unknown origin)
Bioorg Med Chem Lett 18: 4355-9 (2008)
Article DOI: 10.1016/j.bmcl.2008.06.071
BindingDB Entry DOI: 10.7270/Q2GH9HRM