BDBM50262630 Biphenyl-2-ylmethyl-(R)-pyrrolidin-3-yl-carbamic acid ethyl ester::CHEMBL514560
SMILES: CCOC(=O)N(Cc1ccccc1-c1ccccc1)[C@@H]1CCNC1
InChI Key: InChIKey=DRWJMJVERMOJBX-GOSISDBHSA-N
Data: 3 KI  1 IC50
Activity Spreadsheet -- Enzyme Inhibition Constant Data from BindingDB
Found 4 hits for monomerid = 50262630
Trg + Lig
Ki
nM
ΔG°
kcal/mole
IC50
nM
Kd
nM
EC50/IC50
nM
koff
s-1
kon
M-1s-1
pHTemp
°C
Sodium-dependent noradrenaline transporter
(Homo sapiens (Human))
BDBM50262630
(Biphenyl-2-ylmethyl-(R)-pyrrolidin-3-yl-carbamic a...)
Show SMILES CCOC(=O)N(Cc1ccccc1-c1ccccc1)[C@@H]1CCNC1 |r|
Show InChI InChI=1S/C20H24N2O2/c1-2-24-20(23)22(18-12-13-21-14-18)15-17-10-6-7-11-19(17)16-8-4-3-5-9-16/h3-11,18,21H,2,12-15H2,1H3/t18-/m1/s1
Reactome pathway
16n/an/an/an/an/an/an/an/a
Pfizer Global Research and Development
Curated by ChEMBL
Assay Description
Inhibition of [3H]nisoxetine reuptake at human NET expressed in HEK293 cells by SPA
Bioorg Med Chem Lett 18: 4355-9 (2008)
Article DOI: 10.1016/j.bmcl.2008.06.071
BindingDB Entry DOI: 10.7270/Q2GH9HRM
Sodium-dependent serotonin transporter
(Homo sapiens (Human))
BDBM50262630
(Biphenyl-2-ylmethyl-(R)-pyrrolidin-3-yl-carbamic a...)
Show SMILES CCOC(=O)N(Cc1ccccc1-c1ccccc1)[C@@H]1CCNC1 |r|
Show InChI InChI=1S/C20H24N2O2/c1-2-24-20(23)22(18-12-13-21-14-18)15-17-10-6-7-11-19(17)16-8-4-3-5-9-16/h3-11,18,21H,2,12-15H2,1H3/t18-/m1/s1
410n/an/an/an/an/an/an/an/a
Pfizer Global Research and Development
Curated by ChEMBL
Assay Description
Inhibition of [3H]citalopram uptake at human 5HTT expressed in HEK293 cells by SPA
Bioorg Med Chem Lett 18: 4355-9 (2008)
Article DOI: 10.1016/j.bmcl.2008.06.071
BindingDB Entry DOI: 10.7270/Q2GH9HRM
Sodium-dependent dopamine transporter
(Homo sapiens (Human))
BDBM50262630
(Biphenyl-2-ylmethyl-(R)-pyrrolidin-3-yl-carbamic a...)
Show SMILES CCOC(=O)N(Cc1ccccc1-c1ccccc1)[C@@H]1CCNC1 |r|
Show InChI InChI=1S/C20H24N2O2/c1-2-24-20(23)22(18-12-13-21-14-18)15-17-10-6-7-11-19(17)16-8-4-3-5-9-16/h3-11,18,21H,2,12-15H2,1H3/t18-/m1/s1
NCI pathway
Reactome pathway
2.91E+3n/an/an/an/an/an/an/an/a
Pfizer Global Research and Development
Curated by ChEMBL
Assay Description
Inhibition of [3H]dopamine reuptake at human DAT expressed in HEK293 cells by SPA
Bioorg Med Chem Lett 18: 4355-9 (2008)
Article DOI: 10.1016/j.bmcl.2008.06.071
BindingDB Entry DOI: 10.7270/Q2GH9HRM
Cytochrome P450 2D6
(Homo sapiens (Human))
BDBM50262630
(Biphenyl-2-ylmethyl-(R)-pyrrolidin-3-yl-carbamic a...)
Show SMILES CCOC(=O)N(Cc1ccccc1-c1ccccc1)[C@@H]1CCNC1 |r|
Show InChI InChI=1S/C20H24N2O2/c1-2-24-20(23)22(18-12-13-21-14-18)15-17-10-6-7-11-19(17)16-8-4-3-5-9-16/h3-11,18,21H,2,12-15H2,1H3/t18-/m1/s1
n/an/a 350n/an/an/an/an/an/a
Pfizer Global Research and Development
Curated by ChEMBL
Assay Description
Inhibition of CYP2D6 (unknown origin)
Bioorg Med Chem Lett 18: 4355-9 (2008)
Article DOI: 10.1016/j.bmcl.2008.06.071
BindingDB Entry DOI: 10.7270/Q2GH9HRM