BDBM50262748 2-Methyl-3-[4-({3-[(3R)-3-methyl-1-piperidinyl]propyl}oxy)phenyl]-4(3H)-quinazolinone::CHEMBL516126
SMILES: C[C@@H]1CCCN(CCCOc2ccc(cc2)-n2c(C)nc3ccccc3c2=O)C1
InChI Key: InChIKey=JJPQJBHHIMNRNW-GOSISDBHSA-N
Data: 1 IC50
Activity Spreadsheet -- Enzyme Inhibition Constant Data from BindingDB
Found 1 hit for monomerid = 50262748
Trg + Lig
Ki
nM
ΔG°
kcal/mole
IC50
nM
Kd
nM
EC50/IC50
nM
koff
s-1
kon
M-1s-1
pHTemp
°C
Histamine H3 receptor
(Homo sapiens (Human))
BDBM50262748
(2-Methyl-3-[4-({3-[(3R)-3-methyl-1-piperidinyl]pro...)
Show SMILES C[C@@H]1CCCN(CCCOc2ccc(cc2)-n2c(C)nc3ccccc3c2=O)C1 |r|
Show InChI InChI=1S/C24H29N3O2/c1-18-7-5-14-26(17-18)15-6-16-29-21-12-10-20(11-13-21)27-19(2)25-23-9-4-3-8-22(23)24(27)28/h3-4,8-13,18H,5-7,14-17H2,1-2H3/t18-/m1/s1
Reactome pathway
n/an/a 41n/an/an/an/an/an/a
Tsukuba Research Institute
Curated by ChEMBL
Assay Description
Displacement of [3H]N-alpha-methylhistamine from human histamine H3 receptor expressed in CHO-K1 cells
J Med Chem 51: 4780-9 (2008)
Article DOI: 10.1021/jm8003834
BindingDB Entry DOI: 10.7270/Q2FQ9WFW