BDBM50262776 (1-(3-methoxyphenyl)-2-p-tolyl-1H-imidazol-4-yl)(4-(naphthalen-2-yl)piperazin-1-yl)methanone::CHEMBL479046
SMILES: COc1cccc(c1)-n1cc(nc1-c1ccc(C)cc1)C(=O)N1CCN(CC1)c1ccc2ccccc2c1
InChI Key: InChIKey=FKENHYZIIRWWCW-UHFFFAOYSA-N
Data: 1 IC50  1 EC50
Activity Spreadsheet -- Enzyme Inhibition Constant Data from BindingDB
Found 2 hits for monomerid = 50262776
Trg + Lig
Ki
nM
ΔG°
kcal/mole
IC50
nM
Kd
nM
EC50/IC50
nM
koff
s-1
kon
M-1s-1
pHTemp
°C
Cholecystokinin receptor
(Homo sapiens (Human))
BDBM50262776
((1-(3-methoxyphenyl)-2-p-tolyl-1H-imidazol-4-yl)(4...)
Show SMILES COc1cccc(c1)-n1cc(nc1-c1ccc(C)cc1)C(=O)N1CCN(CC1)c1ccc2ccccc2c1
Show InChI InChI=1S/C32H30N4O2/c1-23-10-12-25(13-11-23)31-33-30(22-36(31)28-8-5-9-29(21-28)38-2)32(37)35-18-16-34(17-19-35)27-15-14-24-6-3-4-7-26(24)20-27/h3-15,20-22H,16-19H2,1-2H3
Reactome pathway
n/an/a 2.5n/an/an/an/an/an/a
Merck Research Laboratories
Curated by ChEMBL
Assay Description
Inhibition of human CCK1 receptor
Bioorg Med Chem Lett 18: 4393-6 (2008)
Article DOI: 10.1016/j.bmcl.2008.06.057
BindingDB Entry DOI: 10.7270/Q2HH6JW0
Cholecystokinin receptor
(Homo sapiens (Human))
BDBM50262776
((1-(3-methoxyphenyl)-2-p-tolyl-1H-imidazol-4-yl)(4...)
Show SMILES COc1cccc(c1)-n1cc(nc1-c1ccc(C)cc1)C(=O)N1CCN(CC1)c1ccc2ccccc2c1
Show InChI InChI=1S/C32H30N4O2/c1-23-10-12-25(13-11-23)31-33-30(22-36(31)28-8-5-9-29(21-28)38-2)32(37)35-18-16-34(17-19-35)27-15-14-24-6-3-4-7-26(24)20-27/h3-15,20-22H,16-19H2,1-2H3
Reactome pathway
n/an/an/an/a 9.60n/an/an/an/a
Merck Research Laboratories
Curated by ChEMBL
Assay Description
Agonist activity against human CCK1 receptor
Bioorg Med Chem Lett 18: 4393-6 (2008)
Article DOI: 10.1016/j.bmcl.2008.06.057
BindingDB Entry DOI: 10.7270/Q2HH6JW0