BDBM50262860 (4-(isoquinolin-6-yl)piperazin-1-yl)(1-(3-methoxyphenyl)-2-p-tolyl-1H-imidazol-4-yl)methanone::CHEMBL514716
SMILES: COc1cccc(c1)-n1cc(nc1-c1ccc(C)cc1)C(=O)N1CCN(CC1)c1ccc2cnccc2c1
InChI Key: InChIKey=FSYHXNXAVQZWOZ-UHFFFAOYSA-N
Data: 1 IC50  1 EC50
Activity Spreadsheet -- Enzyme Inhibition Constant Data from BindingDB
Found 2 hits for monomerid = 50262860
Trg + Lig
Ki
nM
ΔG°
kcal/mole
IC50
nM
Kd
nM
EC50/IC50
nM
koff
s-1
kon
M-1s-1
pHTemp
°C
Cholecystokinin receptor
(Homo sapiens (Human))
BDBM50262860
((4-(isoquinolin-6-yl)piperazin-1-yl)(1-(3-methoxyp...)
Show SMILES COc1cccc(c1)-n1cc(nc1-c1ccc(C)cc1)C(=O)N1CCN(CC1)c1ccc2cnccc2c1
Show InChI InChI=1S/C31H29N5O2/c1-22-6-8-23(9-7-22)30-33-29(21-36(30)27-4-3-5-28(19-27)38-2)31(37)35-16-14-34(15-17-35)26-11-10-25-20-32-13-12-24(25)18-26/h3-13,18-21H,14-17H2,1-2H3
Reactome pathway
n/an/a 190n/an/an/an/an/an/a
Merck Research Laboratories
Curated by ChEMBL
Assay Description
Inhibition of human CCK1 receptor
Bioorg Med Chem Lett 18: 4393-6 (2008)
Article DOI: 10.1016/j.bmcl.2008.06.057
BindingDB Entry DOI: 10.7270/Q2HH6JW0
Cholecystokinin receptor
(Homo sapiens (Human))
BDBM50262860
((4-(isoquinolin-6-yl)piperazin-1-yl)(1-(3-methoxyp...)
Show SMILES COc1cccc(c1)-n1cc(nc1-c1ccc(C)cc1)C(=O)N1CCN(CC1)c1ccc2cnccc2c1
Show InChI InChI=1S/C31H29N5O2/c1-22-6-8-23(9-7-22)30-33-29(21-36(30)27-4-3-5-28(19-27)38-2)31(37)35-16-14-34(15-17-35)26-11-10-25-20-32-13-12-24(25)18-26/h3-13,18-21H,14-17H2,1-2H3
Reactome pathway
n/an/an/an/a 106n/an/an/an/a
Merck Research Laboratories
Curated by ChEMBL
Assay Description
Agonist activity against human CCK1 receptor
Bioorg Med Chem Lett 18: 4393-6 (2008)
Article DOI: 10.1016/j.bmcl.2008.06.057
BindingDB Entry DOI: 10.7270/Q2HH6JW0