BDBM50263018 (1-(2,3-dihydrobenzo[b][1,4]dioxin-5-yl)-2-p-tolyl-1H-imidazol-4-yl)(4-(naphthalen-2-yl)piperazin-1-yl)methanone::CHEMBL476519
SMILES: Cc1ccc(cc1)-c1nc(cn1-c1cccc2OCCOc12)C(=O)N1CCN(CC1)c1ccc2ccccc2c1
InChI Key: InChIKey=PJXUJOWRGMSQHK-UHFFFAOYSA-N
Data: 1 IC50  1 EC50
Activity Spreadsheet -- Enzyme Inhibition Constant Data from BindingDB
Found 2 hits for monomerid = 50263018
Trg + Lig
Ki
nM
ΔG°
kcal/mole
IC50
nM
Kd
nM
EC50/IC50
nM
koff
s-1
kon
M-1s-1
pHTemp
°C
Cholecystokinin receptor
(Homo sapiens (Human))
BDBM50263018
((1-(2,3-dihydrobenzo[b][1,4]dioxin-5-yl)-2-p-tolyl...)
Show SMILES Cc1ccc(cc1)-c1nc(cn1-c1cccc2OCCOc12)C(=O)N1CCN(CC1)c1ccc2ccccc2c1
Show InChI InChI=1S/C33H30N4O3/c1-23-9-11-25(12-10-23)32-34-28(22-37(32)29-7-4-8-30-31(29)40-20-19-39-30)33(38)36-17-15-35(16-18-36)27-14-13-24-5-2-3-6-26(24)21-27/h2-14,21-22H,15-20H2,1H3
Reactome pathway
n/an/a 140n/an/an/an/an/an/a
Merck Research Laboratories
Curated by ChEMBL
Assay Description
Inhibition of human CCK1 receptor
Bioorg Med Chem Lett 18: 4393-6 (2008)
Article DOI: 10.1016/j.bmcl.2008.06.057
BindingDB Entry DOI: 10.7270/Q2HH6JW0
Cholecystokinin receptor
(Homo sapiens (Human))
BDBM50263018
((1-(2,3-dihydrobenzo[b][1,4]dioxin-5-yl)-2-p-tolyl...)
Show SMILES Cc1ccc(cc1)-c1nc(cn1-c1cccc2OCCOc12)C(=O)N1CCN(CC1)c1ccc2ccccc2c1
Show InChI InChI=1S/C33H30N4O3/c1-23-9-11-25(12-10-23)32-34-28(22-37(32)29-7-4-8-30-31(29)40-20-19-39-30)33(38)36-17-15-35(16-18-36)27-14-13-24-5-2-3-6-26(24)21-27/h2-14,21-22H,15-20H2,1H3
Reactome pathway
n/an/an/an/a 471n/an/an/an/a
Merck Research Laboratories
Curated by ChEMBL
Assay Description
Agonist activity against human CCK1 receptor
Bioorg Med Chem Lett 18: 4393-6 (2008)
Article DOI: 10.1016/j.bmcl.2008.06.057
BindingDB Entry DOI: 10.7270/Q2HH6JW0