BDBM50263047 (R)-2-(((2R,3R,4S)-3,4-dihydroxypyrrolidin-2-yl)methylamino)-2-phenylethyl 4-bromobenzoate::CHEMBL476718
SMILES: O[C@H]1CN[C@H](CN[C@@H](COC(=O)c2ccc(Br)cc2)c2ccccc2)[C@H]1O
InChI Key: InChIKey=DMUHMLRTLZPLJQ-YDZRNGNQSA-N
Data: 3 IC50
Activity Spreadsheet -- Enzyme Inhibition Constant Data from BindingDB
Found 3 hits for monomerid = 50263047
Trg + Lig
Ki
nM
ΔG°
kcal/mole
IC50
nM
Kd
nM
EC50/IC50
nM
koff
s-1
kon
M-1s-1
pHTemp
°C
Lysosomal alpha-mannosidase
(Homo sapiens (Human))
BDBM50263047
((R)-2-(((2R,3R,4S)-3,4-dihydroxypyrrolidin-2-yl)me...)
Show SMILES O[C@H]1CN[C@H](CN[C@@H](COC(=O)c2ccc(Br)cc2)c2ccccc2)[C@H]1O |r|
Show InChI InChI=1S/C20H23BrN2O4/c21-15-8-6-14(7-9-15)20(26)27-12-17(13-4-2-1-3-5-13)22-10-16-19(25)18(24)11-23-16/h1-9,16-19,22-25H,10-12H2/t16-,17+,18+,19-/m1/s1
n/an/a 7.50E+4n/an/an/an/an/an/a
Ecole Polytechnique Fédérale de Lausanne
Curated by ChEMBL
Assay Description
Inhibition of alpha-mannosidase in human LNZ308 cells
Bioorg Med Chem 16: 7337-46 (2008)
Article DOI: 10.1016/j.bmc.2008.06.021
BindingDB Entry DOI: 10.7270/Q2668D0J
Lysosomal alpha-mannosidase
(Homo sapiens (Human))
BDBM50263047
((R)-2-(((2R,3R,4S)-3,4-dihydroxypyrrolidin-2-yl)me...)
Show SMILES O[C@H]1CN[C@H](CN[C@@H](COC(=O)c2ccc(Br)cc2)c2ccccc2)[C@H]1O |r|
Show InChI InChI=1S/C20H23BrN2O4/c21-15-8-6-14(7-9-15)20(26)27-12-17(13-4-2-1-3-5-13)22-10-16-19(25)18(24)11-23-16/h1-9,16-19,22-25H,10-12H2/t16-,17+,18+,19-/m1/s1
n/an/a 7.50E+4n/an/an/an/an/an/a
Ecole Polytechnique Fédérale de Lausanne
Curated by ChEMBL
Assay Description
Inhibition of alpha-mannosidase in human HCEC
Bioorg Med Chem 16: 7337-46 (2008)
Article DOI: 10.1016/j.bmc.2008.06.021
BindingDB Entry DOI: 10.7270/Q2668D0J
Lysosomal alpha-mannosidase
(Homo sapiens (Human))
BDBM50263047
((R)-2-(((2R,3R,4S)-3,4-dihydroxypyrrolidin-2-yl)me...)
Show SMILES O[C@H]1CN[C@H](CN[C@@H](COC(=O)c2ccc(Br)cc2)c2ccccc2)[C@H]1O |r|
Show InChI InChI=1S/C20H23BrN2O4/c21-15-8-6-14(7-9-15)20(26)27-12-17(13-4-2-1-3-5-13)22-10-16-19(25)18(24)11-23-16/h1-9,16-19,22-25H,10-12H2/t16-,17+,18+,19-/m1/s1
n/an/a 2.00E+5n/an/an/an/an/an/a
Ecole Polytechnique Fédérale de Lausanne
Curated by ChEMBL
Assay Description
Inhibition of alpha-mannosidase in human LN18 cells
Bioorg Med Chem 16: 7337-46 (2008)
Article DOI: 10.1016/j.bmc.2008.06.021
BindingDB Entry DOI: 10.7270/Q2668D0J