BDBM50263064 CHEMBL478626::Furan-3-carboxylic acid [6-chloro-4'-(cyclopropylmethyl-carbamoyl)-biphenyl-3-yl]-amide
SMILES: Clc1ccc(NC(=O)c2ccoc2)cc1-c1ccc(cc1)C(=O)NCC1CC1
InChI Key: InChIKey=JMZYWGGMSKIVST-UHFFFAOYSA-N
Data: 1 KI  1 IC50
Activity Spreadsheet -- Enzyme Inhibition Constant Data from BindingDB
Found 2 hits for monomerid = 50263064
Trg + Lig
Ki
nM
ΔG°
kcal/mole
IC50
nM
Kd
nM
EC50/IC50
nM
koff
s-1
kon
M-1s-1
pHTemp
°C
Mitogen-activated protein kinase 14
(Homo sapiens (Human))
BDBM50263064
(CHEMBL478626 | Furan-3-carboxylic acid [6-chloro-4...)
Show SMILES Clc1ccc(NC(=O)c2ccoc2)cc1-c1ccc(cc1)C(=O)NCC1CC1
Show InChI InChI=1S/C22H19ClN2O3/c23-20-8-7-18(25-22(27)17-9-10-28-13-17)11-19(20)15-3-5-16(6-4-15)21(26)24-12-14-1-2-14/h3-11,13-14H,1-2,12H2,(H,24,26)(H,25,27)
NCI pathway
Reactome pathway
10n/an/an/an/an/an/an/an/a
GlaxoSmithKline R&D
Curated by ChEMBL
Assay Description
Displacement of rhodamine-green labelled (2-(6-amino-3-imino-3H-xanthen-9-yl)-5-{[({4-[4-(4-Cl-3-hydroxyphenyl)-5-(4-pyridinyl)-1H-imidazol-2yl]pheny...
Bioorg Med Chem Lett 18: 4428-32 (2008)
Article DOI: 10.1016/j.bmcl.2008.06.048
BindingDB Entry DOI: 10.7270/Q2CR5T5P
Mitogen-activated protein kinase 14
(Homo sapiens (Human))
BDBM50263064
(CHEMBL478626 | Furan-3-carboxylic acid [6-chloro-4...)
Show SMILES Clc1ccc(NC(=O)c2ccoc2)cc1-c1ccc(cc1)C(=O)NCC1CC1
Show InChI InChI=1S/C22H19ClN2O3/c23-20-8-7-18(25-22(27)17-9-10-28-13-17)11-19(20)15-3-5-16(6-4-15)21(26)24-12-14-1-2-14/h3-11,13-14H,1-2,12H2,(H,24,26)(H,25,27)
NCI pathway
Reactome pathway
n/an/a 63n/an/an/an/an/an/a
GlaxoSmithKline R&D
Curated by ChEMBL
Assay Description
Displacement of rhodamine-green labelled (2-(6-amino-3-imino-3H-xanthen-9-yl)-5-{[({4-[4-(4-Cl-3-hydroxyphenyl)-5-(4-pyridinyl)-1H-imidazol-2yl]pheny...
Bioorg Med Chem Lett 18: 4428-32 (2008)
Article DOI: 10.1016/j.bmcl.2008.06.048
BindingDB Entry DOI: 10.7270/Q2CR5T5P