BDBM50263069 4-(1-isopropyl-2-methyl-1H-imidazol-5-yl)-N-(4-(4-(2-methoxyethylsulfonyl)piperazin-1-yl)phenyl)pyrimidin-2-amine::CHEMBL514384
SMILES: COCCS(=O)(=O)N1CCN(CC1)c1ccc(Nc2nccc(n2)-c2cnc(C)n2C(C)C)cc1
InChI Key: InChIKey=PBZUWKJLMGWBDP-UHFFFAOYSA-N
Data: 1 IC50
Activity Spreadsheet -- Enzyme Inhibition Constant Data from BindingDB
Found 1 hit for monomerid = 50263069
Trg + Lig
Ki
nM
ΔG°
kcal/mole
IC50
nM
Kd
nM
EC50/IC50
nM
koff
s-1
kon
M-1s-1
pHTemp
°C
Potassium voltage-gated channel subfamily H member 2
(Homo sapiens (Human))
BDBM50263069
(4-(1-isopropyl-2-methyl-1H-imidazol-5-yl)-N-(4-(4-...)
Show SMILES COCCS(=O)(=O)N1CCN(CC1)c1ccc(Nc2nccc(n2)-c2cnc(C)n2C(C)C)cc1
Show InChI InChI=1S/C24H33N7O3S/c1-18(2)31-19(3)26-17-23(31)22-9-10-25-24(28-22)27-20-5-7-21(8-6-20)29-11-13-30(14-12-29)35(32,33)16-15-34-4/h5-10,17-18H,11-16H2,1-4H3,(H,25,27,28)
Reactome pathway
n/an/a 8.40E+3n/an/an/an/an/an/a
AstraZeneca Pharmaceuticals
Curated by ChEMBL
Assay Description
Inhibition of human ERG
Bioorg Med Chem Lett 18: 4442-6 (2008)
Article DOI: 10.1016/j.bmcl.2008.06.027
BindingDB Entry DOI: 10.7270/Q24749PG