BDBM50263147 CHEMBL476577::N-(1-(4-(5-fluoro-4-(1-isopropyl-2-methyl-1H-imidazol-5-yl)pyrimidin-2-ylamino)phenyl)azetidin-3-yl)acetamide
SMILES: CC(C)n1c(C)ncc1-c1nc(Nc2ccc(cc2)N2CC(C2)NC(C)=O)ncc1F
InChI Key: InChIKey=TUCLZQAUTAVVBA-UHFFFAOYSA-N
Data: 1 IC50
Activity Spreadsheet -- Enzyme Inhibition Constant Data from BindingDB
Found 1 hit for monomerid = 50263147
Trg + Lig
Ki
nM
ΔG°
kcal/mole
IC50
nM
Kd
nM
EC50/IC50
nM
koff
s-1
kon
M-1s-1
pHTemp
°C
Cyclin-dependent kinase 2
(Homo sapiens (Human))
BDBM50263147
(CHEMBL476577 | N-(1-(4-(5-fluoro-4-(1-isopropyl-2-...)
Show SMILES CC(C)n1c(C)ncc1-c1nc(Nc2ccc(cc2)N2CC(C2)NC(C)=O)ncc1F
Show InChI InChI=1S/C22H26FN7O/c1-13(2)30-14(3)24-10-20(30)21-19(23)9-25-22(28-21)27-16-5-7-18(8-6-16)29-11-17(12-29)26-15(4)31/h5-10,13,17H,11-12H2,1-4H3,(H,26,31)(H,25,27,28)
NCI pathway
Reactome pathway
n/an/a 0.5n/an/an/an/an/an/a
AstraZeneca Pharmaceuticals
Curated by ChEMBL
Assay Description
Inhibition of CDK2/Cyclin E (unknown origin)
Bioorg Med Chem Lett 18: 4442-6 (2008)
Article DOI: 10.1016/j.bmcl.2008.06.027
BindingDB Entry DOI: 10.7270/Q24749PG