BDBM50263228 3-(4-(1-(2,3-dihydrobenzo[b][1,4]dioxin-6-yl)-2-p-tolyl-1H-imidazole-4-carbonyl)piperazin-1-yl)-1-naphthoic acid::CHEMBL451644
SMILES: Cc1ccc(cc1)-c1nc(cn1-c1ccc2OCCOc2c1)C(=O)N1CCN(CC1)c1cc(C(O)=O)c2ccccc2c1
InChI Key: InChIKey=FOWILVQQAZMQDQ-UHFFFAOYSA-N
Data: 2 IC50  1 EC50
Activity Spreadsheet -- Enzyme Inhibition Constant Data from BindingDB
Found 3 hits for monomerid = 50263228
Trg + Lig
Ki
nM
ΔG°
kcal/mole
IC50
nM
Kd
nM
EC50/IC50
nM
koff
s-1
kon
M-1s-1
pHTemp
°C
Cholecystokinin receptor
(Homo sapiens (Human))
BDBM50263228
(3-(4-(1-(2,3-dihydrobenzo[b][1,4]dioxin-6-yl)-2-p-...)
Show SMILES Cc1ccc(cc1)-c1nc(cn1-c1ccc2OCCOc2c1)C(=O)N1CCN(CC1)c1cc(C(O)=O)c2ccccc2c1
Show InChI InChI=1S/C34H30N4O5/c1-22-6-8-23(9-7-22)32-35-29(21-38(32)25-10-11-30-31(20-25)43-17-16-42-30)33(39)37-14-12-36(13-15-37)26-18-24-4-2-3-5-27(24)28(19-26)34(40)41/h2-11,18-21H,12-17H2,1H3,(H,40,41)
Reactome pathway
n/an/an/an/a 0.140n/an/an/an/a
Merck Research Laboratories
Curated by ChEMBL
Assay Description
Agonist activity against human CCK1 receptor
Bioorg Med Chem Lett 18: 4393-6 (2008)
Article DOI: 10.1016/j.bmcl.2008.06.057
BindingDB Entry DOI: 10.7270/Q2HH6JW0
Cholecystokinin receptor
(Homo sapiens (Human))
BDBM50263228
(3-(4-(1-(2,3-dihydrobenzo[b][1,4]dioxin-6-yl)-2-p-...)
Show SMILES Cc1ccc(cc1)-c1nc(cn1-c1ccc2OCCOc2c1)C(=O)N1CCN(CC1)c1cc(C(O)=O)c2ccccc2c1
Show InChI InChI=1S/C34H30N4O5/c1-22-6-8-23(9-7-22)32-35-29(21-38(32)25-10-11-30-31(20-25)43-17-16-42-30)33(39)37-14-12-36(13-15-37)26-18-24-4-2-3-5-27(24)28(19-26)34(40)41/h2-11,18-21H,12-17H2,1H3,(H,40,41)
Reactome pathway
n/an/a 0.140n/an/an/an/an/an/a
Merck Research Laboratories
Curated by ChEMBL
Assay Description
Inhibition of human CCK1 receptor
Bioorg Med Chem Lett 18: 4393-6 (2008)
Article DOI: 10.1016/j.bmcl.2008.06.057
BindingDB Entry DOI: 10.7270/Q2HH6JW0
Cholecystokinin receptor
(Homo sapiens (Human))
BDBM50263228
(3-(4-(1-(2,3-dihydrobenzo[b][1,4]dioxin-6-yl)-2-p-...)
Show SMILES Cc1ccc(cc1)-c1nc(cn1-c1ccc2OCCOc2c1)C(=O)N1CCN(CC1)c1cc(C(O)=O)c2ccccc2c1
Show InChI InChI=1S/C34H30N4O5/c1-22-6-8-23(9-7-22)32-35-29(21-38(32)25-10-11-30-31(20-25)43-17-16-42-30)33(39)37-14-12-36(13-15-37)26-18-24-4-2-3-5-27(24)28(19-26)34(40)41/h2-11,18-21H,12-17H2,1H3,(H,40,41)
Reactome pathway
n/an/a>1.00E+4n/an/an/an/an/an/a
Merck Research Laboratories
Curated by ChEMBL
Assay Description
Inhibition of human CCK2 receptor
Bioorg Med Chem Lett 18: 4393-6 (2008)
Article DOI: 10.1016/j.bmcl.2008.06.057
BindingDB Entry DOI: 10.7270/Q2HH6JW0