BDBM50263321 CHEMBL476962::N-methyl-3-oxo-N-[2-(piperidin-1-yl)ethyl]-3H-spiro[2-benzofuran-1,4'-piperidine]-1'-carboxamide
SMILES: CN(CCN1CCCCC1)C(=O)N1CCC2(CC1)OC(=O)c1ccccc21
InChI Key: InChIKey=OPICQGZFKRRTAK-UHFFFAOYSA-N
Data: 1 IC50
Activity Spreadsheet -- Enzyme Inhibition Constant Data from BindingDB
Found 1 hit for monomerid = 50263321
Trg + Lig
Ki
nM
ΔG°
kcal/mole
IC50
nM
Kd
nM
EC50/IC50
nM
koff
s-1
kon
M-1s-1
pHTemp
°C
Histamine H3 receptor
(Homo sapiens (Human))
BDBM50263321
(CHEMBL476962 | N-methyl-3-oxo-N-[2-(piperidin-1-yl...)
Show SMILES CN(CCN1CCCCC1)C(=O)N1CCC2(CC1)OC(=O)c1ccccc21
Show InChI InChI=1S/C21H29N3O3/c1-22(15-16-23-11-5-2-6-12-23)20(26)24-13-9-21(10-14-24)18-8-4-3-7-17(18)19(25)27-21/h3-4,7-8H,2,5-6,9-16H2,1H3
Reactome pathway
n/an/a 21n/an/an/an/an/an/a
Tsukuba Research Institute
Curated by ChEMBL
Assay Description
Inverse agonist activity at human cloned histamine H3 receptor assessed as inhibition of (R)-alpha-methylhistamine-induced [35S]GTPgammaS binding
Bioorg Med Chem Lett 18: 5101-6 (2008)
Article DOI: 10.1016/j.bmcl.2008.07.125
BindingDB Entry DOI: 10.7270/Q2PC3268