BDBM50263322 CHEMBL476963::N-methyl-N-[2-(piperidin-1-yl)ethyl]-3H-spiro[2-benzofuran-1,4'-piperidine]-1'-carboxamide
SMILES: CN(CCN1CCCCC1)C(=O)N1CCC2(CC1)OCc1ccccc21
InChI Key: InChIKey=ONGCGJBTVIZKLI-UHFFFAOYSA-N
Data: 1 IC50
Activity Spreadsheet -- Enzyme Inhibition Constant Data from BindingDB
Found 1 hit for monomerid = 50263322
Trg + Lig
Ki
nM
ΔG°
kcal/mole
IC50
nM
Kd
nM
EC50/IC50
nM
koff
s-1
kon
M-1s-1
pHTemp
°C
Histamine H3 receptor
(Homo sapiens (Human))
BDBM50263322
(CHEMBL476963 | N-methyl-N-[2-(piperidin-1-yl)ethyl...)
Show SMILES CN(CCN1CCCCC1)C(=O)N1CCC2(CC1)OCc1ccccc21
Show InChI InChI=1S/C21H31N3O2/c1-22(15-16-23-11-5-2-6-12-23)20(25)24-13-9-21(10-14-24)19-8-4-3-7-18(19)17-26-21/h3-4,7-8H,2,5-6,9-17H2,1H3
Reactome pathway
n/an/a 387n/an/an/an/an/an/a
Tsukuba Research Institute
Curated by ChEMBL
Assay Description
Inverse agonist activity at human cloned histamine H3 receptor assessed as inhibition of (R)-alpha-methylhistamine-induced [35S]GTPgammaS binding
Bioorg Med Chem Lett 18: 5101-6 (2008)
Article DOI: 10.1016/j.bmcl.2008.07.125
BindingDB Entry DOI: 10.7270/Q2PC3268