BDBM50263806 (E)-3-(4-(3-(8-methyl-8-azabicyclo[3.2.1]octan-3-ylamino)phenylthio)-2,3-bis(trifluoromethyl)phenyl)-1-morpholinoprop-2-en-1-one::CHEMBL444773
SMILES: CN1C2CCC1CC(C2)Nc1cccc(Sc2ccc(\C=C\C(=O)N3CCOCC3)c(c2C(F)(F)F)C(F)(F)F)c1
InChI Key: InChIKey=FEEFNAKFIFJCIA-UXBLZVDNSA-N
Data: 1 IC50
Activity Spreadsheet -- Enzyme Inhibition Constant Data from BindingDB
Found 1 hit for monomerid = 50263806
Trg + Lig
Ki
nM
ΔG°
kcal/mole
IC50
nM
Kd
nM
EC50/IC50
nM
koff
s-1
kon
M-1s-1
pHTemp
°C
Integrin alpha-L/beta-2 (LFA-1)
(Homo sapiens (Human))
BDBM50263806
((E)-3-(4-(3-(8-methyl-8-azabicyclo[3.2.1]octan-3-y...)
Show SMILES CN1C2CCC1CC(C2)Nc1cccc(Sc2ccc(\C=C\C(=O)N3CCOCC3)c(c2C(F)(F)F)C(F)(F)F)c1 |THB:9:7:1:3.4|
Show InChI InChI=1S/C29H31F6N3O2S/c1-37-21-7-8-22(37)16-20(15-21)36-19-3-2-4-23(17-19)41-24-9-5-18(6-10-25(39)38-11-13-40-14-12-38)26(28(30,31)32)27(24)29(33,34)35/h2-6,9-10,17,20-22,36H,7-8,11-16H2,1H3/b10-6+
NCI pathway
Reactome pathway
n/an/a 0.940n/an/an/an/an/an/a
Biogen Idec Inc.
Curated by ChEMBL
Assay Description
Inhibition of recombinant LFA1/ICAM1-IG interaction (unknown origin) by time-resolved fluorimetry method
Bioorg Med Chem Lett 18: 5249-51 (2008)
Article DOI: 10.1016/j.bmcl.2008.08.061
BindingDB Entry DOI: 10.7270/Q2CV4HK0