BDBM50263817 5-benzyl-3-(4-chlorophenyl)pyrazolo[1,5-a]pyrimidin-7(4H)-one::CHEMBL505210
SMILES: Clc1ccc(cc1)-c1c[nH]n2c1nc(Cc1ccccc1)cc2=O
InChI Key: InChIKey=FIFAUXGBTKHTIJ-UHFFFAOYSA-N
Data: 2 IC50
Activity Spreadsheet -- Enzyme Inhibition Constant Data from BindingDB
Found 2 hits for monomerid = 50263817
Trg + Lig
Ki
nM
ΔG°
kcal/mole
IC50
nM
Kd
nM
EC50/IC50
nM
koff
s-1
kon
M-1s-1
pHTemp
°C
1-deoxy-D-xylulose-5-phosphate synthase
(Mycobacterium tuberculosis)
BDBM50263817
(5-benzyl-3-(4-chlorophenyl)pyrazolo[1,5-a]pyrimidi...)
Show SMILES Clc1ccc(cc1)-c1c[nH]n2c1nc(Cc1ccccc1)cc2=O
Show InChI InChI=1S/C19H14ClN3O/c20-15-8-6-14(7-9-15)17-12-21-23-18(24)11-16(22-19(17)23)10-13-4-2-1-3-5-13/h1-9,11-12,21H,10H2
n/an/a 1.14E+5n/an/an/an/an/an/a
University of Illinois at Chicago
Curated by ChEMBL
Assay Description
Inhibition of Mycobacterium tuberculosis cloned 1-deoxy-D-xylulose-5-phosphate synthase expressed in Escherichia coli
Bioorg Med Chem Lett 18: 5320-3 (2008)
Article DOI: 10.1016/j.bmcl.2008.08.034
BindingDB Entry DOI: 10.7270/Q2TX3F71
Transketolase
(Homo sapiens (Human))
BDBM50263817
(5-benzyl-3-(4-chlorophenyl)pyrazolo[1,5-a]pyrimidi...)
Show SMILES Clc1ccc(cc1)-c1c[nH]n2c1nc(Cc1ccccc1)cc2=O
Show InChI InChI=1S/C19H14ClN3O/c20-15-8-6-14(7-9-15)17-12-21-23-18(24)11-16(22-19(17)23)10-13-4-2-1-3-5-13/h1-9,11-12,21H,10H2
Reactome pathway
n/an/a 3.90E+3n/an/an/an/an/an/a
University of Illinois at Chicago
Curated by ChEMBL
Assay Description
Inhibition of human recombinant transketolase expressed in Escherichia coli
Bioorg Med Chem Lett 18: 5320-3 (2008)
Article DOI: 10.1016/j.bmcl.2008.08.034
BindingDB Entry DOI: 10.7270/Q2TX3F71