BDBM50263876 5-benzyl-3-phenyl-2-(trifluoromethyl)pyrazolo[1,5-a]pyrimidin-7(4H)-one::CHEMBL490176
SMILES: FC(F)(F)c1[nH]n2c(nc(Cc3ccccc3)cc2=O)c1-c1ccccc1
InChI Key: InChIKey=WNCFZQKISJWVME-UHFFFAOYSA-N
Data: 1 IC50
Activity Spreadsheet -- Enzyme Inhibition Constant Data from BindingDB
Found 1 hit for monomerid = 50263876
Trg + Lig
Ki
nM
ΔG°
kcal/mole
IC50
nM
Kd
nM
EC50/IC50
nM
koff
s-1
kon
M-1s-1
pHTemp
°C
1-deoxy-D-xylulose-5-phosphate synthase
(Mycobacterium tuberculosis)
BDBM50263876
(5-benzyl-3-phenyl-2-(trifluoromethyl)pyrazolo[1,5-...)
Show SMILES FC(F)(F)c1[nH]n2c(nc(Cc3ccccc3)cc2=O)c1-c1ccccc1
Show InChI InChI=1S/C20H14F3N3O/c21-20(22,23)18-17(14-9-5-2-6-10-14)19-24-15(12-16(27)26(19)25-18)11-13-7-3-1-4-8-13/h1-10,12,25H,11H2
n/an/a 7.11E+4n/an/an/an/an/an/a
University of Illinois at Chicago
Curated by ChEMBL
Assay Description
Inhibition of Mycobacterium tuberculosis cloned 1-deoxy-D-xylulose-5-phosphate synthase expressed in Escherichia coli
Bioorg Med Chem Lett 18: 5320-3 (2008)
Article DOI: 10.1016/j.bmcl.2008.08.034
BindingDB Entry DOI: 10.7270/Q2TX3F71