BDBM50263930 4-(2-(6-methoxybenzofuran-2-yl)vinyl)-N,N-dimethylbenzenamine::CHEMBL524141
SMILES: COc1ccc2cc(\C=C\c3ccc(cc3)N(C)C)oc2c1
InChI Key: InChIKey=GAAPZOXKUKNOPB-UXBLZVDNSA-N
Data: 1 IC50
Activity Spreadsheet -- Enzyme Inhibition Constant Data from BindingDB
Found 1 hit for monomerid = 50263930
Trg + Lig
Ki
nM
ΔG°
kcal/mole
IC50
nM
Kd
nM
EC50/IC50
nM
koff
s-1
kon
M-1s-1
pHTemp
°C
Beta amyloid A4 protein
(Homo sapiens (Human))
BDBM50263930
(4-(2-(6-methoxybenzofuran-2-yl)vinyl)-N,N-dimethyl...)
Show SMILES COc1ccc2cc(\C=C\c3ccc(cc3)N(C)C)oc2c1
Show InChI InChI=1S/C19H19NO2/c1-20(2)16-8-4-14(5-9-16)6-10-18-12-15-7-11-17(21-3)13-19(15)22-18/h4-13H,1-3H3/b10-6+
Reactome pathway
n/an/a 70n/an/an/an/an/an/a
Institute of Science and Technology
Curated by ChEMBL
Assay Description
Inhibition of amyloid beta42 fibril formation by thioflavin T formation
Bioorg Med Chem Lett 18: 5591-3 (2008)
Article DOI: 10.1016/j.bmcl.2008.08.111
BindingDB Entry DOI: 10.7270/Q20K29G7