BDBM50263938 CHEMBL4062559
SMILES: [H][C@@]12CCCN1C(=O)[C@H](Cc1ccc3ccccc3c1)NC(=O)[C@H](CCCNC(N)=N)N(C)C(=O)[C@@H](NC(=O)[C@@H](Cc1ccc(O)cc1)NC2=O)C(C)C
InChI Key: InChIKey=VLVFZYONSPOLQK-UZYORVLWSA-N
Data: 2 IC50
Activity Spreadsheet -- Enzyme Inhibition Constant Data from BindingDB
Found 2 hits for monomerid = 50263938
Trg + Lig
Ki
nM
ΔG°
kcal/mole
IC50
nM
Kd
nM
EC50/IC50
nM
koff
s-1
kon
M-1s-1
pHTemp
°C
C-X-C chemokine receptor type 4
(Homo sapiens (Human))
BDBM50263938
(CHEMBL4062559)
Show SMILES [H][C@@]12CCCN1C(=O)[C@H](Cc1ccc3ccccc3c1)NC(=O)[C@H](CCCNC(N)=N)N(C)C(=O)[C@@H](NC(=O)[C@@H](Cc1ccc(O)cc1)NC2=O)C(C)C |r|
Show InChI InChI=1S/C39H50N8O6/c1-23(2)33-38(53)46(3)31(10-6-18-42-39(40)41)35(50)44-30(22-25-12-15-26-8-4-5-9-27(26)20-25)37(52)47-19-7-11-32(47)36(51)43-29(34(49)45-33)21-24-13-16-28(48)17-14-24/h4-5,8-9,12-17,20,23,29-33,48H,6-7,10-11,18-19,21-22H2,1-3H3,(H,43,51)(H,44,50)(H,45,49)(H4,40,41,42)/t29-,30+,31+,32+,33+/m1/s1
n/an/a>3.00E+4n/an/an/an/an/an/a
Kyoto University
Curated by ChEMBL
Assay Description
Displacement of [125I]SDF-1alpha from CXCR4 (unknown origin) expressed in HEK293 cells after 1 hr by scintillation counting method
J Med Chem 61: 3745-3751 (2018)
Article DOI: 10.1021/acs.jmedchem.8b00336
BindingDB Entry DOI: 10.7270/Q23B62M5
C-X-C chemokine receptor type 7 (CXCR7)
(Homo sapiens (Human))
BDBM50263938
(CHEMBL4062559)
Show SMILES [H][C@@]12CCCN1C(=O)[C@H](Cc1ccc3ccccc3c1)NC(=O)[C@H](CCCNC(N)=N)N(C)C(=O)[C@@H](NC(=O)[C@@H](Cc1ccc(O)cc1)NC2=O)C(C)C |r|
Show InChI InChI=1S/C39H50N8O6/c1-23(2)33-38(53)46(3)31(10-6-18-42-39(40)41)35(50)44-30(22-25-12-15-26-8-4-5-9-27(26)20-25)37(52)47-19-7-11-32(47)36(51)43-29(34(49)45-33)21-24-13-16-28(48)17-14-24/h4-5,8-9,12-17,20,23,29-33,48H,6-7,10-11,18-19,21-22H2,1-3H3,(H,43,51)(H,44,50)(H,45,49)(H4,40,41,42)/t29-,30+,31+,32+,33+/m1/s1
n/an/a 2.00E+3n/an/an/an/an/an/a
Kyoto University
Curated by ChEMBL
Assay Description
Displacement of [125I]SDF-1alpha from ACKR3 (unknown origin) expressed in CHO cells after 1 hr by scintillation counting method
J Med Chem 61: 3745-3751 (2018)
Article DOI: 10.1021/acs.jmedchem.8b00336
BindingDB Entry DOI: 10.7270/Q23B62M5