BDBM50263977 CHEMBL4071724
SMILES: [H][C@@]12CCCN1C(=O)[C@H](Cc1ccc3ccccc3c1)NC(=O)[C@H](CCCCNC(N)=N)N(C)C(=O)[C@H](CCCNC(N)=N)NC(=O)[C@@H](Cc1ccc(O)cc1)NC2=O
InChI Key: InChIKey=SATXTTWOVBEXMC-VLGXOXMCSA-N
Data: 2 IC50
Activity Spreadsheet -- Enzyme Inhibition Constant Data from BindingDB
Found 2 hits for monomerid = 50263977
Trg + Lig
Ki
nM
ΔG°
kcal/mole
IC50
nM
Kd
nM
EC50/IC50
nM
koff
s-1
kon
M-1s-1
pHTemp
°C
C-X-C chemokine receptor type 7 (CXCR7)
(Homo sapiens (Human))
BDBM50263977
(CHEMBL4071724)
Show SMILES [H][C@@]12CCCN1C(=O)[C@H](Cc1ccc3ccccc3c1)NC(=O)[C@H](CCCCNC(N)=N)N(C)C(=O)[C@H](CCCNC(N)=N)NC(=O)[C@@H](Cc1ccc(O)cc1)NC2=O |r|
Show InChI InChI=1S/C41H55N11O6/c1-51-33(11-4-5-19-46-40(42)43)36(55)50-32(24-26-13-16-27-8-2-3-9-28(27)22-26)39(58)52-21-7-12-34(52)37(56)49-31(23-25-14-17-29(53)18-15-25)35(54)48-30(38(51)57)10-6-20-47-41(44)45/h2-3,8-9,13-18,22,30-34,53H,4-7,10-12,19-21,23-24H2,1H3,(H,48,54)(H,49,56)(H,50,55)(H4,42,43,46)(H4,44,45,47)/t30-,31+,32-,33-,34-/m0/s1
n/an/a 560n/an/an/an/an/an/a
Kyoto University
Curated by ChEMBL
Assay Description
Displacement of [125I]SDF-1alpha from ACKR3 (unknown origin) expressed in CHO cells after 1 hr by scintillation counting method
J Med Chem 61: 3745-3751 (2018)
Article DOI: 10.1021/acs.jmedchem.8b00336
BindingDB Entry DOI: 10.7270/Q23B62M5
C-X-C chemokine receptor type 4
(Homo sapiens (Human))
BDBM50263977
(CHEMBL4071724)
Show SMILES [H][C@@]12CCCN1C(=O)[C@H](Cc1ccc3ccccc3c1)NC(=O)[C@H](CCCCNC(N)=N)N(C)C(=O)[C@H](CCCNC(N)=N)NC(=O)[C@@H](Cc1ccc(O)cc1)NC2=O |r|
Show InChI InChI=1S/C41H55N11O6/c1-51-33(11-4-5-19-46-40(42)43)36(55)50-32(24-26-13-16-27-8-2-3-9-28(27)22-26)39(58)52-21-7-12-34(52)37(56)49-31(23-25-14-17-29(53)18-15-25)35(54)48-30(38(51)57)10-6-20-47-41(44)45/h2-3,8-9,13-18,22,30-34,53H,4-7,10-12,19-21,23-24H2,1H3,(H,48,54)(H,49,56)(H,50,55)(H4,42,43,46)(H4,44,45,47)/t30-,31+,32-,33-,34-/m0/s1
n/an/a>3.00E+4n/an/an/an/an/an/a
Kyoto University
Curated by ChEMBL
Assay Description
Displacement of [125I]SDF-1alpha from CXCR4 (unknown origin) expressed in HEK293 cells after 1 hr by scintillation counting method
J Med Chem 61: 3745-3751 (2018)
Article DOI: 10.1021/acs.jmedchem.8b00336
BindingDB Entry DOI: 10.7270/Q23B62M5