BDBM50264013 4-tert-butyl-N-methyl-N-(2-(piperidin-1-yl)ethyl)piperidine-1-carboxamide::CHEMBL490787
SMILES: CN(CCN1CCCCC1)C(=O)N1CCC(CC1)C(C)(C)C
InChI Key: InChIKey=OMSWMMOJUVZXGB-UHFFFAOYSA-N
Data: 1 IC50
Activity Spreadsheet -- Enzyme Inhibition Constant Data from BindingDB
Found 1 hit for monomerid = 50264013
Trg + Lig
Ki
nM
ΔG°
kcal/mole
IC50
nM
Kd
nM
EC50/IC50
nM
koff
s-1
kon
M-1s-1
pHTemp
°C
Histamine H3 receptor
(Homo sapiens (Human))
BDBM50264013
(4-tert-butyl-N-methyl-N-(2-(piperidin-1-yl)ethyl)p...)
Show SMILES CN(CCN1CCCCC1)C(=O)N1CCC(CC1)C(C)(C)C
Show InChI InChI=1S/C18H35N3O/c1-18(2,3)16-8-12-21(13-9-16)17(22)19(4)14-15-20-10-6-5-7-11-20/h16H,5-15H2,1-4H3
Reactome pathway
n/an/a>1.00E+3n/an/an/an/an/an/a
Tsukuba Research Institute
Curated by ChEMBL
Assay Description
Inverse agonist activity at human cloned histamine H3 receptor assessed as inhibition of (R)-alpha-methylhistamine-induced [35S]GTPgammaS binding
Bioorg Med Chem Lett 18: 5101-6 (2008)
Article DOI: 10.1016/j.bmcl.2008.07.125
BindingDB Entry DOI: 10.7270/Q2PC3268