BDBM50264090 2-methyl-5-(naphthalen-2-yl)-3-phenylpyrazolo[1,5-a]pyrimidin-7(4H)-one::CHEMBL491216
SMILES: Cc1[nH]n2c(nc(cc2=O)-c2ccc3ccccc3c2)c1-c1ccccc1
InChI Key: InChIKey=DIYVWYIVOQADON-UHFFFAOYSA-N
Data: 1 IC50
Activity Spreadsheet -- Enzyme Inhibition Constant Data from BindingDB
Found 1 hit for monomerid = 50264090
Trg + Lig
Ki
nM
ΔG°
kcal/mole
IC50
nM
Kd
nM
EC50/IC50
nM
koff
s-1
kon
M-1s-1
pHTemp
°C
1-deoxy-D-xylulose-5-phosphate synthase
(Mycobacterium tuberculosis)
BDBM50264090
(2-methyl-5-(naphthalen-2-yl)-3-phenylpyrazolo[1,5-...)
Show SMILES Cc1[nH]n2c(nc(cc2=O)-c2ccc3ccccc3c2)c1-c1ccccc1
Show InChI InChI=1S/C23H17N3O/c1-15-22(17-8-3-2-4-9-17)23-24-20(14-21(27)26(23)25-15)19-12-11-16-7-5-6-10-18(16)13-19/h2-14,25H,1H3
n/an/a 1.95E+4n/an/an/an/an/an/a
University of Illinois at Chicago
Curated by ChEMBL
Assay Description
Inhibition of Mycobacterium tuberculosis cloned 1-deoxy-D-xylulose-5-phosphate synthase expressed in Escherichia coli
Bioorg Med Chem Lett 18: 5320-3 (2008)
Article DOI: 10.1016/j.bmcl.2008.08.034
BindingDB Entry DOI: 10.7270/Q2TX3F71