BDBM50264098 CHEMBL4101089
SMILES: CN1[C@@H](CCCNC(N)=O)C(=O)N[C@@H](Cc2ccc3ccccc3c2)C(=O)N(C)[C@@H](Cc2c[nH]c3ccccc23)C(=O)N[C@H](Cc2ccc(O)cc2)C(=O)N[C@@H](CCCNC(N)=N)C1=O
InChI Key: InChIKey=OSGIEBKVHBEXHN-DRTMTWGASA-N
Data: 2 IC50
Activity Spreadsheet -- Enzyme Inhibition Constant Data from BindingDB
Found 2 hits for monomerid = 50264098
Trg + Lig
Ki
nM
ΔG°
kcal/mole
IC50
nM
Kd
nM
EC50/IC50
nM
koff
s-1
kon
M-1s-1
pHTemp
°C
C-X-C chemokine receptor type 4
(Homo sapiens (Human))
BDBM50264098
(CHEMBL4101089)
Show SMILES CN1[C@@H](CCCNC(N)=O)C(=O)N[C@@H](Cc2ccc3ccccc3c2)C(=O)N(C)[C@@H](Cc2c[nH]c3ccccc23)C(=O)N[C@H](Cc2ccc(O)cc2)C(=O)N[C@@H](CCCNC(N)=N)C1=O |r|
Show InChI InChI=1S/C47H57N11O7/c1-57-39(14-8-22-52-47(50)65)42(61)56-38(25-29-15-18-30-9-3-4-10-31(30)23-29)45(64)58(2)40(26-32-27-53-35-12-6-5-11-34(32)35)43(62)55-37(24-28-16-19-33(59)20-17-28)41(60)54-36(44(57)63)13-7-21-51-46(48)49/h3-6,9-12,15-20,23,27,36-40,53,59H,7-8,13-14,21-22,24-26H2,1-2H3,(H,54,60)(H,55,62)(H,56,61)(H4,48,49,51)(H3,50,52,65)/t36-,37+,38-,39-,40-/m0/s1
n/an/a 1.00E+4n/an/an/an/an/an/a
Kyoto University
Curated by ChEMBL
Assay Description
Displacement of [125I]SDF-1alpha from CXCR4 (unknown origin) expressed in HEK293 cells after 1 hr by scintillation counting method
J Med Chem 61: 3745-3751 (2018)
Article DOI: 10.1021/acs.jmedchem.8b00336
BindingDB Entry DOI: 10.7270/Q23B62M5
C-X-C chemokine receptor type 7 (CXCR7)
(Homo sapiens (Human))
BDBM50264098
(CHEMBL4101089)
Show SMILES CN1[C@@H](CCCNC(N)=O)C(=O)N[C@@H](Cc2ccc3ccccc3c2)C(=O)N(C)[C@@H](Cc2c[nH]c3ccccc23)C(=O)N[C@H](Cc2ccc(O)cc2)C(=O)N[C@@H](CCCNC(N)=N)C1=O |r|
Show InChI InChI=1S/C47H57N11O7/c1-57-39(14-8-22-52-47(50)65)42(61)56-38(25-29-15-18-30-9-3-4-10-31(30)23-29)45(64)58(2)40(26-32-27-53-35-12-6-5-11-34(32)35)43(62)55-37(24-28-16-19-33(59)20-17-28)41(60)54-36(44(57)63)13-7-21-51-46(48)49/h3-6,9-12,15-20,23,27,36-40,53,59H,7-8,13-14,21-22,24-26H2,1-2H3,(H,54,60)(H,55,62)(H,56,61)(H4,48,49,51)(H3,50,52,65)/t36-,37+,38-,39-,40-/m0/s1
n/an/a 520n/an/an/an/an/an/a
Kyoto University
Curated by ChEMBL
Assay Description
Displacement of [125I]SDF-1alpha from ACKR3 (unknown origin) expressed in CHO cells after 1 hr by scintillation counting method
J Med Chem 61: 3745-3751 (2018)
Article DOI: 10.1021/acs.jmedchem.8b00336
BindingDB Entry DOI: 10.7270/Q23B62M5