BDBM50264580 7-(5-methoxy-1H-indol-2-yl)isoindolin-1-one::CHEMBL520975
SMILES: COc1ccc2[nH]c(cc2c1)-c1cccc2CNC(=O)c12
InChI Key: InChIKey=FUUBYTOMQKCISV-UHFFFAOYSA-N
Data: 3 IC50
Activity Spreadsheet -- Enzyme Inhibition Constant Data from BindingDB
Found 3 hits for monomerid = 50264580
Trg + Lig
Ki
nM
ΔG°
kcal/mole
IC50
nM
Kd
nM
EC50/IC50
nM
koff
s-1
kon
M-1s-1
pHTemp
°C
Vascular endothelial growth factor receptor 2
(Homo sapiens (Human))
BDBM50264580
(7-(5-methoxy-1H-indol-2-yl)isoindolin-1-one | CHEM...)
Show SMILES COc1ccc2[nH]c(cc2c1)-c1cccc2CNC(=O)c12
Show InChI InChI=1S/C17H14N2O2/c1-21-12-5-6-14-11(7-12)8-15(19-14)13-4-2-3-10-9-18-17(20)16(10)13/h2-8,19H,9H2,1H3,(H,18,20)
NCI pathway
Reactome pathway
n/an/a 1.10E+3n/an/an/an/an/an/a
Johnson & Johnson Pharmaceutical Research and Development
Curated by ChEMBL
Assay Description
Inhibition of VEGFR2 (unknown origin)
Bioorg Med Chem Lett 18: 5130-3 (2008)
Article DOI: 10.1016/j.bmcl.2008.07.090
BindingDB Entry DOI: 10.7270/Q2RF5TVZ
Cyclin-dependent kinase 1
(Homo sapiens (Human))
BDBM50264580
(7-(5-methoxy-1H-indol-2-yl)isoindolin-1-one | CHEM...)
Show SMILES COc1ccc2[nH]c(cc2c1)-c1cccc2CNC(=O)c12
Show InChI InChI=1S/C17H14N2O2/c1-21-12-5-6-14-11(7-12)8-15(19-14)13-4-2-3-10-9-18-17(20)16(10)13/h2-8,19H,9H2,1H3,(H,18,20)
Reactome pathway
n/an/a>1.00E+5n/an/an/an/an/an/a
Johnson & Johnson Pharmaceutical Research and Development
Curated by ChEMBL
Assay Description
Inhibition of CDK1 (unknown origin)
Bioorg Med Chem Lett 18: 5130-3 (2008)
Article DOI: 10.1016/j.bmcl.2008.07.090
BindingDB Entry DOI: 10.7270/Q2RF5TVZ
Aurora kinase A
(Homo sapiens (Human))
BDBM50264580
(7-(5-methoxy-1H-indol-2-yl)isoindolin-1-one | CHEM...)
Show SMILES COc1ccc2[nH]c(cc2c1)-c1cccc2CNC(=O)c12
Show InChI InChI=1S/C17H14N2O2/c1-21-12-5-6-14-11(7-12)8-15(19-14)13-4-2-3-10-9-18-17(20)16(10)13/h2-8,19H,9H2,1H3,(H,18,20)
NCI pathway
Reactome pathway
n/an/a 338n/an/an/an/an/an/a
Johnson & Johnson Pharmaceutical Research and Development
Curated by ChEMBL
Assay Description
Inhibition of Aurora A (unknown origin)
Bioorg Med Chem Lett 18: 5130-3 (2008)
Article DOI: 10.1016/j.bmcl.2008.07.090
BindingDB Entry DOI: 10.7270/Q2RF5TVZ