BDBM50264614 7-(5-methoxy-1H-benzo[d]imidazol-2-yl)isoindolin-1-one::CHEMBL507927
SMILES: COc1ccc2nc([nH]c2c1)-c1cccc2CNC(=O)c12
InChI Key: InChIKey=NWJXSQTVATYZMG-UHFFFAOYSA-N
Data: 2 IC50
Activity Spreadsheet -- Enzyme Inhibition Constant Data from BindingDB
Found 2 hits for monomerid = 50264614
Trg + Lig
Ki
nM
ΔG°
kcal/mole
IC50
nM
Kd
nM
EC50/IC50
nM
koff
s-1
kon
M-1s-1
pHTemp
°C
Aurora kinase A
(Homo sapiens (Human))
BDBM50264614
(7-(5-methoxy-1H-benzo[d]imidazol-2-yl)isoindolin-1...)
Show SMILES COc1ccc2nc([nH]c2c1)-c1cccc2CNC(=O)c12
Show InChI InChI=1S/C16H13N3O2/c1-21-10-5-6-12-13(7-10)19-15(18-12)11-4-2-3-9-8-17-16(20)14(9)11/h2-7H,8H2,1H3,(H,17,20)(H,18,19)
NCI pathway
Reactome pathway
n/an/a 205n/an/an/an/an/an/a
Johnson & Johnson Pharmaceutical Research and Development
Curated by ChEMBL
Assay Description
Inhibition of Aurora A (unknown origin)
Bioorg Med Chem Lett 18: 5130-3 (2008)
Article DOI: 10.1016/j.bmcl.2008.07.090
BindingDB Entry DOI: 10.7270/Q2RF5TVZ
Vascular endothelial growth factor receptor 2
(Homo sapiens (Human))
BDBM50264614
(7-(5-methoxy-1H-benzo[d]imidazol-2-yl)isoindolin-1...)
Show SMILES COc1ccc2nc([nH]c2c1)-c1cccc2CNC(=O)c12
Show InChI InChI=1S/C16H13N3O2/c1-21-10-5-6-12-13(7-10)19-15(18-12)11-4-2-3-9-8-17-16(20)14(9)11/h2-7H,8H2,1H3,(H,17,20)(H,18,19)
NCI pathway
Reactome pathway
n/an/a 142n/an/an/an/an/an/a
Johnson & Johnson Pharmaceutical Research and Development
Curated by ChEMBL
Assay Description
Inhibition of VEGFR2 (unknown origin)
Bioorg Med Chem Lett 18: 5130-3 (2008)
Article DOI: 10.1016/j.bmcl.2008.07.090
BindingDB Entry DOI: 10.7270/Q2RF5TVZ