BDBM50264740 4-(4'-fluorobiphenyl-4-yloxy)-2-(2H-tetrazol-5-yl)thieno[2,3-c]pyridine::CHEMBL491435
SMILES: Fc1ccc(cc1)-c1ccc(Oc2cncc3sc(cc23)-c2nnn[nH]2)cc1
InChI Key: InChIKey=NVHFCFINJLHLKY-UHFFFAOYSA-N
Data: 3 IC50
Activity Spreadsheet -- Enzyme Inhibition Constant Data from BindingDB
Found 3 hits for monomerid = 50264740
Trg + Lig
Ki
nM
ΔG°
kcal/mole
IC50
nM
Kd
nM
EC50/IC50
nM
koff
s-1
kon
M-1s-1
pHTemp
°C
Mitogen-activated protein kinase kinase kinase 8
(Homo sapiens (Human))
BDBM50264740
(4-(4'-fluorobiphenyl-4-yloxy)-2-(2H-tetrazol-5-yl)...)
Show SMILES Fc1ccc(cc1)-c1ccc(Oc2cncc3sc(cc23)-c2nnn[nH]2)cc1
Show InChI InChI=1S/C20H12FN5OS/c21-14-5-1-12(2-6-14)13-3-7-15(8-4-13)27-17-10-22-11-19-16(17)9-18(28-19)20-23-25-26-24-20/h1-11H,(H,23,24,25,26)
NCI pathway
Reactome pathway
n/an/a 170n/an/an/an/an/an/a
Abbott Bioresearch Center
Curated by ChEMBL
Assay Description
Inhibition of human recombinant COT by HTRF-based assay
Bioorg Med Chem Lett 18: 4952-5 (2008)
Article DOI: 10.1016/j.bmcl.2008.08.037
BindingDB Entry DOI: 10.7270/Q23J3CTH
Mitogen-activated protein kinase kinase kinase 8
(Homo sapiens (Human))
BDBM50264740
(4-(4'-fluorobiphenyl-4-yloxy)-2-(2H-tetrazol-5-yl)...)
Show SMILES Fc1ccc(cc1)-c1ccc(Oc2cncc3sc(cc23)-c2nnn[nH]2)cc1
Show InChI InChI=1S/C20H12FN5OS/c21-14-5-1-12(2-6-14)13-3-7-15(8-4-13)27-17-10-22-11-19-16(17)9-18(28-19)20-23-25-26-24-20/h1-11H,(H,23,24,25,26)
NCI pathway
Reactome pathway
n/an/a 6.50E+3n/an/an/an/an/an/a
Abbott Bioresearch Center
Curated by ChEMBL
Assay Description
Inhibition of COT (unknown origin) by cell-based HTRF assay
Bioorg Med Chem Lett 18: 4952-5 (2008)
Article DOI: 10.1016/j.bmcl.2008.08.037
BindingDB Entry DOI: 10.7270/Q23J3CTH
Dual specificity mitogen-activated protein kinase kinase 1
(Homo sapiens (Human))
BDBM50264740
(4-(4'-fluorobiphenyl-4-yloxy)-2-(2H-tetrazol-5-yl)...)
Show SMILES Fc1ccc(cc1)-c1ccc(Oc2cncc3sc(cc23)-c2nnn[nH]2)cc1
Show InChI InChI=1S/C20H12FN5OS/c21-14-5-1-12(2-6-14)13-3-7-15(8-4-13)27-17-10-22-11-19-16(17)9-18(28-19)20-23-25-26-24-20/h1-11H,(H,23,24,25,26)
Reactome pathway
n/an/a 7.60E+3n/an/an/an/an/an/a
Abbott Bioresearch Center
Curated by ChEMBL
Assay Description
Inhibition of MEK1 (unknown origin) by HTRF assay
Bioorg Med Chem Lett 18: 4952-5 (2008)
Article DOI: 10.1016/j.bmcl.2008.08.037
BindingDB Entry DOI: 10.7270/Q23J3CTH