BDBM50264846 CHEMBL4066531
SMILES: Cc1nc(C)c(s1)-c1csc(Nc2ccc(cn2)C(=O)N2C3CCC2CN(C3)c2ncc(Br)cn2)n1
InChI Key: InChIKey=AMIMAZLNPMKJPH-UHFFFAOYSA-N
Data: 1 IC50
Activity Spreadsheet -- Enzyme Inhibition Constant Data from BindingDB
Found 1 hit for monomerid = 50264846
Trg + Lig
Ki
nM
ΔG°
kcal/mole
IC50
nM
Kd
nM
EC50/IC50
nM
koff
s-1
kon
M-1s-1
pHTemp
°C
Transient receptor potential cation channel subfamily V member 4
(Homo sapiens (Human))
BDBM50264846
(CHEMBL4066531)
Show SMILES Cc1nc(C)c(s1)-c1csc(Nc2ccc(cn2)C(=O)N2C3CCC2CN(C3)c2ncc(Br)cn2)n1
Show InChI InChI=1S/C24H23BrN8OS2/c1-13-21(36-14(2)29-13)19-12-35-24(30-19)31-20-6-3-15(7-26-20)22(34)33-17-4-5-18(33)11-32(10-17)23-27-8-16(25)9-28-23/h3,6-9,12,17-18H,4-5,10-11H2,1-2H3,(H,26,30,31)
n/an/a 0.210n/an/an/an/an/an/a
Shionogi& Co., Ltd
Curated by ChEMBL
Assay Description
Antagonist activity at recombinant human TRPV4 expressed in CHOK1 cells assessed as inhibition of 4alphaPDD-induced activation pretreated for 5 mins ...
Bioorg Med Chem 25: 2177-2190 (2017)
Article DOI: 10.1016/j.bmc.2017.02.047
BindingDB Entry DOI: 10.7270/Q2N58PT9