BDBM50264848 CHEMBL4062935
SMILES: Cc1nc(C)c(s1)-c1csc(Nc2ccc(cn2)C(=O)N2C3CCC2CN(C3)c2ncc(CO)cn2)n1
InChI Key: InChIKey=FPLUNKNUQGGPTQ-UHFFFAOYSA-N
Data: 1 IC50
Activity Spreadsheet -- Enzyme Inhibition Constant Data from BindingDB
Found 1 hit for monomerid = 50264848
Trg + Lig
Ki
nM
ΔG°
kcal/mole
IC50
nM
Kd
nM
EC50/IC50
nM
koff
s-1
kon
M-1s-1
pHTemp
°C
Transient receptor potential cation channel subfamily V member 4
(Homo sapiens (Human))
BDBM50264848
(CHEMBL4062935)
Show SMILES Cc1nc(C)c(s1)-c1csc(Nc2ccc(cn2)C(=O)N2C3CCC2CN(C3)c2ncc(CO)cn2)n1
Show InChI InChI=1S/C25H26N8O2S2/c1-14-22(37-15(2)29-14)20-13-36-25(30-20)31-21-6-3-17(9-26-21)23(35)33-18-4-5-19(33)11-32(10-18)24-27-7-16(12-34)8-28-24/h3,6-9,13,18-19,34H,4-5,10-12H2,1-2H3,(H,26,30,31)
n/an/a 0.650n/an/an/an/an/an/a
Shionogi& Co., Ltd
Curated by ChEMBL
Assay Description
Antagonist activity at recombinant human TRPV4 expressed in CHOK1 cells assessed as inhibition of 4alphaPDD-induced activation pretreated for 5 mins ...
Bioorg Med Chem 25: 2177-2190 (2017)
Article DOI: 10.1016/j.bmc.2017.02.047
BindingDB Entry DOI: 10.7270/Q2N58PT9