BDBM50264871 2-(6-(6-(dimethylamino)pyridazin-3-ylamino)-2H-benzo[b][1,4]oxazin-4(3H)-yl)-6,6-dimethyl-6,7-dihydrothiazolo[5,4-c]pyridin-4(5H)-one::CHEMBL489596
SMILES: CN(C)c1ccc(Nc2ccc3OCCN(c4nc5CC(C)(C)NC(=O)c5s4)c3c2)nn1
InChI Key: InChIKey=FJHIWTMAONNZST-UHFFFAOYSA-N
Data: 2 IC50
Activity Spreadsheet -- Enzyme Inhibition Constant Data from BindingDB
Found 2 hits for monomerid = 50264871
Trg + Lig
Ki
nM
ΔG°
kcal/mole
IC50
nM
Kd
nM
EC50/IC50
nM
koff
s-1
kon
M-1s-1
pHTemp
°C
Phosphatidylinositol 4,5-bisphosphate 3-kinase catalytic subunit gamma isoform
(Homo sapiens (Human))
BDBM50264871
(2-(6-(6-(dimethylamino)pyridazin-3-ylamino)-2H-ben...)
Show SMILES CN(C)c1ccc(Nc2ccc3OCCN(c4nc5CC(C)(C)NC(=O)c5s4)c3c2)nn1
Show InChI InChI=1S/C22H25N7O2S/c1-22(2)12-14-19(20(30)25-22)32-21(24-14)29-9-10-31-16-6-5-13(11-15(16)29)23-17-7-8-18(27-26-17)28(3)4/h5-8,11H,9-10,12H2,1-4H3,(H,23,26)(H,25,30)
NCI pathway
Reactome pathway
n/an/a 24n/an/an/an/an/an/a
UCB
Curated by ChEMBL
Assay Description
Inhibition of PI3Kgamma (unknown origin)
Bioorg Med Chem Lett 18: 5299-302 (2008)
Article DOI: 10.1016/j.bmcl.2008.08.042
BindingDB Entry DOI: 10.7270/Q2WS8T3X
Phosphatidylinositol 4,5-bisphosphate 3-kinase catalytic subunit delta isoform
(Homo sapiens (Human))
BDBM50264871
(2-(6-(6-(dimethylamino)pyridazin-3-ylamino)-2H-ben...)
Show SMILES CN(C)c1ccc(Nc2ccc3OCCN(c4nc5CC(C)(C)NC(=O)c5s4)c3c2)nn1
Show InChI InChI=1S/C22H25N7O2S/c1-22(2)12-14-19(20(30)25-22)32-21(24-14)29-9-10-31-16-6-5-13(11-15(16)29)23-17-7-8-18(27-26-17)28(3)4/h5-8,11H,9-10,12H2,1-4H3,(H,23,26)(H,25,30)
NCI pathway
Reactome pathway
n/an/a 12n/an/an/an/an/an/a
UCB
Curated by ChEMBL
Assay Description
Inhibition of PI3Kdelta (unknown origin)
Bioorg Med Chem Lett 18: 5299-302 (2008)
Article DOI: 10.1016/j.bmcl.2008.08.042
BindingDB Entry DOI: 10.7270/Q2WS8T3X