BDBM50264872 2-(6-(6-methoxypyridazin-3-ylamino)-2H-benzo[b][1,4]oxazin-4(3H)-yl)-6,6-dimethyl-6,7-dihydrothiazolo[5,4-c]pyridin-4(5H)-one::CHEMBL522910
SMILES: COc1ccc(Nc2ccc3OCCN(c4nc5CC(C)(C)NC(=O)c5s4)c3c2)nn1
InChI Key: InChIKey=KDCLKSQWABSKKF-UHFFFAOYSA-N
Data: 2 IC50
Activity Spreadsheet -- Enzyme Inhibition Constant Data from BindingDB
Found 2 hits for monomerid = 50264872
Trg + Lig
Ki
nM
ΔG°
kcal/mole
IC50
nM
Kd
nM
EC50/IC50
nM
koff
s-1
kon
M-1s-1
pHTemp
°C
Phosphatidylinositol 4,5-bisphosphate 3-kinase catalytic subunit gamma isoform
(Homo sapiens (Human))
BDBM50264872
(2-(6-(6-methoxypyridazin-3-ylamino)-2H-benzo[b][1,...)
Show SMILES COc1ccc(Nc2ccc3OCCN(c4nc5CC(C)(C)NC(=O)c5s4)c3c2)nn1
Show InChI InChI=1S/C21H22N6O3S/c1-21(2)11-13-18(19(28)24-21)31-20(23-13)27-8-9-30-15-5-4-12(10-14(15)27)22-16-6-7-17(29-3)26-25-16/h4-7,10H,8-9,11H2,1-3H3,(H,22,25)(H,24,28)
NCI pathway
Reactome pathway
n/an/a 20n/an/an/an/an/an/a
UCB
Curated by ChEMBL
Assay Description
Inhibition of PI3Kgamma (unknown origin)
Bioorg Med Chem Lett 18: 5299-302 (2008)
Article DOI: 10.1016/j.bmcl.2008.08.042
BindingDB Entry DOI: 10.7270/Q2WS8T3X
Phosphatidylinositol 4,5-bisphosphate 3-kinase catalytic subunit delta isoform
(Homo sapiens (Human))
BDBM50264872
(2-(6-(6-methoxypyridazin-3-ylamino)-2H-benzo[b][1,...)
Show SMILES COc1ccc(Nc2ccc3OCCN(c4nc5CC(C)(C)NC(=O)c5s4)c3c2)nn1
Show InChI InChI=1S/C21H22N6O3S/c1-21(2)11-13-18(19(28)24-21)31-20(23-13)27-8-9-30-15-5-4-12(10-14(15)27)22-16-6-7-17(29-3)26-25-16/h4-7,10H,8-9,11H2,1-3H3,(H,22,25)(H,24,28)
NCI pathway
Reactome pathway
n/an/a 7n/an/an/an/an/an/a
UCB
Curated by ChEMBL
Assay Description
Inhibition of PI3Kdelta (unknown origin)
Bioorg Med Chem Lett 18: 5299-302 (2008)
Article DOI: 10.1016/j.bmcl.2008.08.042
BindingDB Entry DOI: 10.7270/Q2WS8T3X