BDBM50264873 6,6-dimethyl-2-(6-(6-phenylpyridazin-3-ylamino)-2H-benzo[b][1,4]oxazin-4(3H)-yl)-6,7-dihydrothiazolo[5,4-c]pyridin-4(5H)-one::CHEMBL496940
SMILES: CC1(C)Cc2nc(sc2C(=O)N1)N1CCOc2ccc(Nc3ccc(nn3)-c3ccccc3)cc12
InChI Key: InChIKey=XGTSXSXOYSMLKN-UHFFFAOYSA-N
Data: 2 IC50
Activity Spreadsheet -- Enzyme Inhibition Constant Data from BindingDB
Found 2 hits for monomerid = 50264873
Trg + Lig
Ki
nM
ΔG°
kcal/mole
IC50
nM
Kd
nM
EC50/IC50
nM
koff
s-1
kon
M-1s-1
pHTemp
°C
Phosphatidylinositol 4,5-bisphosphate 3-kinase catalytic subunit gamma isoform
(Homo sapiens (Human))
BDBM50264873
(6,6-dimethyl-2-(6-(6-phenylpyridazin-3-ylamino)-2H...)
Show SMILES CC1(C)Cc2nc(sc2C(=O)N1)N1CCOc2ccc(Nc3ccc(nn3)-c3ccccc3)cc12
Show InChI InChI=1S/C26H24N6O2S/c1-26(2)15-19-23(24(33)29-26)35-25(28-19)32-12-13-34-21-10-8-17(14-20(21)32)27-22-11-9-18(30-31-22)16-6-4-3-5-7-16/h3-11,14H,12-13,15H2,1-2H3,(H,27,31)(H,29,33)
NCI pathway
Reactome pathway
n/an/a 34n/an/an/an/an/an/a
UCB
Curated by ChEMBL
Assay Description
Inhibition of PI3Kgamma (unknown origin)
Bioorg Med Chem Lett 18: 5299-302 (2008)
Article DOI: 10.1016/j.bmcl.2008.08.042
BindingDB Entry DOI: 10.7270/Q2WS8T3X
Phosphatidylinositol 4,5-bisphosphate 3-kinase catalytic subunit delta isoform
(Homo sapiens (Human))
BDBM50264873
(6,6-dimethyl-2-(6-(6-phenylpyridazin-3-ylamino)-2H...)
Show SMILES CC1(C)Cc2nc(sc2C(=O)N1)N1CCOc2ccc(Nc3ccc(nn3)-c3ccccc3)cc12
Show InChI InChI=1S/C26H24N6O2S/c1-26(2)15-19-23(24(33)29-26)35-25(28-19)32-12-13-34-21-10-8-17(14-20(21)32)27-22-11-9-18(30-31-22)16-6-4-3-5-7-16/h3-11,14H,12-13,15H2,1-2H3,(H,27,31)(H,29,33)
NCI pathway
Reactome pathway
n/an/a 6n/an/an/an/an/an/a
UCB
Curated by ChEMBL
Assay Description
Inhibition of PI3Kdelta (unknown origin)
Bioorg Med Chem Lett 18: 5299-302 (2008)
Article DOI: 10.1016/j.bmcl.2008.08.042
BindingDB Entry DOI: 10.7270/Q2WS8T3X