BDBM50264916 3-(2-chloro-6-fluorophenyl)-5-(1-(piperidin-4-yl)-1H-pyrazol-4-yl)isoxazole::CHEMBL522076
SMILES: Fc1cccc(Cl)c1-c1cc(on1)-c1cnn(c1)C1CCNCC1
InChI Key: InChIKey=LSNVYEZSGUMHPT-UHFFFAOYSA-N
Data: 1 EC50
Activity Spreadsheet -- Enzyme Inhibition Constant Data from BindingDB
Found 1 hit for monomerid = 50264916
Trg + Lig
Ki
nM
ΔG°
kcal/mole
IC50
nM
Kd
nM
EC50/IC50
nM
koff
s-1
kon
M-1s-1
pHTemp
°C
Neuronal acetylcholine receptor subunit alpha-4
(Homo sapiens (Human))
BDBM50264916
(3-(2-chloro-6-fluorophenyl)-5-(1-(piperidin-4-yl)-...)
Show SMILES Fc1cccc(Cl)c1-c1cc(on1)-c1cnn(c1)C1CCNCC1
Show InChI InChI=1S/C17H16ClFN4O/c18-13-2-1-3-14(19)17(13)15-8-16(24-22-15)11-9-21-23(10-11)12-4-6-20-7-5-12/h1-3,8-10,12,20H,4-7H2
n/an/an/an/a 48n/an/an/an/a
Amgen Inc.
Curated by ChEMBL
Assay Description
Activation of human alpha4beta2 nAChR assessed as potentiation of submaximal response to nicotine induced current
Bioorg Med Chem Lett 18: 5209-12 (2008)
Article DOI: 10.1016/j.bmcl.2008.08.080
BindingDB Entry DOI: 10.7270/Q2SX6D26