BDBM50264920 3-(2-chloro-6-fluorophenyl)-5-(1-ethyl-2-(4-fluoropiperidin-4-yl)-1H-imidazol-5-yl)isoxazole::CHEMBL497370
SMILES: CCn1c(cnc1C1(F)CCNCC1)-c1cc(no1)-c1c(F)cccc1Cl
InChI Key: InChIKey=MKXCECHNTLUQPV-UHFFFAOYSA-N
Data: 1 EC50
Activity Spreadsheet -- Enzyme Inhibition Constant Data from BindingDB
Found 1 hit for monomerid = 50264920
Trg + Lig
Ki
nM
ΔG°
kcal/mole
IC50
nM
Kd
nM
EC50/IC50
nM
koff
s-1
kon
M-1s-1
pHTemp
°C
Neuronal acetylcholine receptor subunit alpha-4
(Homo sapiens (Human))
BDBM50264920
(3-(2-chloro-6-fluorophenyl)-5-(1-ethyl-2-(4-fluoro...)
Show SMILES CCn1c(cnc1C1(F)CCNCC1)-c1cc(no1)-c1c(F)cccc1Cl
Show InChI InChI=1S/C19H19ClF2N4O/c1-2-26-15(11-24-18(26)19(22)6-8-23-9-7-19)16-10-14(25-27-16)17-12(20)4-3-5-13(17)21/h3-5,10-11,23H,2,6-9H2,1H3
n/an/an/an/a 3n/an/an/an/a
Amgen Inc.
Curated by ChEMBL
Assay Description
Activation of human alpha4beta2 nAChR assessed as potentiation of submaximal response to nicotine induced current
Bioorg Med Chem Lett 18: 5209-12 (2008)
Article DOI: 10.1016/j.bmcl.2008.08.080
BindingDB Entry DOI: 10.7270/Q2SX6D26