BDBM50265154 CHEMBL521734::N-cyclopropyl-3-(3-(cyclopropylmethyl)-4-oxo-3,4-dihydrobenzo[d][1,2,3]triazin-7-yl)-4-methylbenzamide
SMILES: Cc1ccc(cc1-c1ccc2c(c1)nnn(CC1CC1)c2=O)C(=O)NC1CC1
InChI Key: InChIKey=GURGQFBRXVKIQG-UHFFFAOYSA-N
Data: 1 KI  9 IC50
Activity Spreadsheet -- Enzyme Inhibition Constant Data from BindingDB
Found 10 hits for monomerid = 50265154
Trg + Lig
Ki
nM
ΔG°
kcal/mole
IC50
nM
Kd
nM
EC50/IC50
nM
koff
s-1
kon
M-1s-1
pHTemp
°C
Mitogen-activated protein kinase 14
(Homo sapiens (Human))
BDBM50265154
(CHEMBL521734 | N-cyclopropyl-3-(3-(cyclopropylmeth...)
Show SMILES Cc1ccc(cc1-c1ccc2c(c1)nnn(CC1CC1)c2=O)C(=O)NC1CC1
Show InChI InChI=1S/C22H22N4O2/c1-13-2-5-16(21(27)23-17-7-8-17)10-19(13)15-6-9-18-20(11-15)24-25-26(22(18)28)12-14-3-4-14/h2,5-6,9-11,14,17H,3-4,7-8,12H2,1H3,(H,23,27)
NCI pathway
Reactome pathway
6n/an/an/an/an/an/an/an/a
GlaxoSmithKline R&D
Curated by ChEMBL
Assay Description
Displacement of fluorescent ATP competitive ligand from p38alpha
Bioorg Med Chem Lett 18: 5285-9 (2008)
Article DOI: 10.1016/j.bmcl.2008.08.051
BindingDB Entry DOI: 10.7270/Q28K7B0R
Macrophage colony stimulating factor receptor
(Homo sapiens (Human))
BDBM50265154
(CHEMBL521734 | N-cyclopropyl-3-(3-(cyclopropylmeth...)
Show SMILES Cc1ccc(cc1-c1ccc2c(c1)nnn(CC1CC1)c2=O)C(=O)NC1CC1
Show InChI InChI=1S/C22H22N4O2/c1-13-2-5-16(21(27)23-17-7-8-17)10-19(13)15-6-9-18-20(11-15)24-25-26(22(18)28)12-14-3-4-14/h2,5-6,9-11,14,17H,3-4,7-8,12H2,1H3,(H,23,27)
n/an/a>2.00E+4n/an/an/an/an/an/a
GlaxoSmithKline R&D
Curated by ChEMBL
Assay Description
Inhibition of cFMS
Bioorg Med Chem Lett 18: 5285-9 (2008)
Article DOI: 10.1016/j.bmcl.2008.08.051
BindingDB Entry DOI: 10.7270/Q28K7B0R
Epidermal growth factor receptor
(Homo sapiens (Human))
BDBM50265154
(CHEMBL521734 | N-cyclopropyl-3-(3-(cyclopropylmeth...)
Show SMILES Cc1ccc(cc1-c1ccc2c(c1)nnn(CC1CC1)c2=O)C(=O)NC1CC1
Show InChI InChI=1S/C22H22N4O2/c1-13-2-5-16(21(27)23-17-7-8-17)10-19(13)15-6-9-18-20(11-15)24-25-26(22(18)28)12-14-3-4-14/h2,5-6,9-11,14,17H,3-4,7-8,12H2,1H3,(H,23,27)
n/an/a>2.50E+4n/an/an/an/an/an/a
GlaxoSmithKline R&D
Curated by ChEMBL
Assay Description
Inhibition of EGFR
Bioorg Med Chem Lett 18: 5285-9 (2008)
Article DOI: 10.1016/j.bmcl.2008.08.051
BindingDB Entry DOI: 10.7270/Q28K7B0R
Vascular endothelial growth factor receptor 2
(Homo sapiens (Human))
BDBM50265154
(CHEMBL521734 | N-cyclopropyl-3-(3-(cyclopropylmeth...)
Show SMILES Cc1ccc(cc1-c1ccc2c(c1)nnn(CC1CC1)c2=O)C(=O)NC1CC1
Show InChI InChI=1S/C22H22N4O2/c1-13-2-5-16(21(27)23-17-7-8-17)10-19(13)15-6-9-18-20(11-15)24-25-26(22(18)28)12-14-3-4-14/h2,5-6,9-11,14,17H,3-4,7-8,12H2,1H3,(H,23,27)
NCI pathway
Reactome pathway
n/an/a>2.00E+4n/an/an/an/an/an/a
GlaxoSmithKline R&D
Curated by ChEMBL
Assay Description
Inhibition of VEGFR2
Bioorg Med Chem Lett 18: 5285-9 (2008)
Article DOI: 10.1016/j.bmcl.2008.08.051
BindingDB Entry DOI: 10.7270/Q28K7B0R
Mitogen-activated protein kinase 10
(Homo sapiens (Human))
BDBM50265154
(CHEMBL521734 | N-cyclopropyl-3-(3-(cyclopropylmeth...)
Show SMILES Cc1ccc(cc1-c1ccc2c(c1)nnn(CC1CC1)c2=O)C(=O)NC1CC1
Show InChI InChI=1S/C22H22N4O2/c1-13-2-5-16(21(27)23-17-7-8-17)10-19(13)15-6-9-18-20(11-15)24-25-26(22(18)28)12-14-3-4-14/h2,5-6,9-11,14,17H,3-4,7-8,12H2,1H3,(H,23,27)
NCI pathway
Reactome pathway
n/an/a>1.60E+4n/an/an/an/an/an/a
GlaxoSmithKline R&D
Curated by ChEMBL
Assay Description
Inhibition of JNK3
Bioorg Med Chem Lett 18: 5285-9 (2008)
Article DOI: 10.1016/j.bmcl.2008.08.051
BindingDB Entry DOI: 10.7270/Q28K7B0R
Tyrosine-protein kinase Lck
(Homo sapiens (Human))
BDBM50265154
(CHEMBL521734 | N-cyclopropyl-3-(3-(cyclopropylmeth...)
Show SMILES Cc1ccc(cc1-c1ccc2c(c1)nnn(CC1CC1)c2=O)C(=O)NC1CC1
Show InChI InChI=1S/C22H22N4O2/c1-13-2-5-16(21(27)23-17-7-8-17)10-19(13)15-6-9-18-20(11-15)24-25-26(22(18)28)12-14-3-4-14/h2,5-6,9-11,14,17H,3-4,7-8,12H2,1H3,(H,23,27)
n/an/a>1.60E+4n/an/an/an/an/an/a
GlaxoSmithKline R&D
Curated by ChEMBL
Assay Description
Inhibition of LCK
Bioorg Med Chem Lett 18: 5285-9 (2008)
Article DOI: 10.1016/j.bmcl.2008.08.051
BindingDB Entry DOI: 10.7270/Q28K7B0R
Serine/threonine-protein kinase PLK1
(Homo sapiens (Human))
BDBM50265154
(CHEMBL521734 | N-cyclopropyl-3-(3-(cyclopropylmeth...)
Show SMILES Cc1ccc(cc1-c1ccc2c(c1)nnn(CC1CC1)c2=O)C(=O)NC1CC1
Show InChI InChI=1S/C22H22N4O2/c1-13-2-5-16(21(27)23-17-7-8-17)10-19(13)15-6-9-18-20(11-15)24-25-26(22(18)28)12-14-3-4-14/h2,5-6,9-11,14,17H,3-4,7-8,12H2,1H3,(H,23,27)
NCI pathway
Reactome pathway
n/an/a>2.50E+4n/an/an/an/an/an/a
GlaxoSmithKline R&D
Curated by ChEMBL
Assay Description
Inhibition of PLK1
Bioorg Med Chem Lett 18: 5285-9 (2008)
Article DOI: 10.1016/j.bmcl.2008.08.051
BindingDB Entry DOI: 10.7270/Q28K7B0R
Serine/threonine-protein kinase Sgk1
(Homo sapiens (Human))
BDBM50265154
(CHEMBL521734 | N-cyclopropyl-3-(3-(cyclopropylmeth...)
Show SMILES Cc1ccc(cc1-c1ccc2c(c1)nnn(CC1CC1)c2=O)C(=O)NC1CC1
Show InChI InChI=1S/C22H22N4O2/c1-13-2-5-16(21(27)23-17-7-8-17)10-19(13)15-6-9-18-20(11-15)24-25-26(22(18)28)12-14-3-4-14/h2,5-6,9-11,14,17H,3-4,7-8,12H2,1H3,(H,23,27)
Reactome pathway
n/an/a 3.20E+4n/an/an/an/an/an/a
GlaxoSmithKline R&D
Curated by ChEMBL
Assay Description
Inhibition of SGK1
Bioorg Med Chem Lett 18: 5285-9 (2008)
Article DOI: 10.1016/j.bmcl.2008.08.051
BindingDB Entry DOI: 10.7270/Q28K7B0R
Cyclin-dependent kinase 2
(Homo sapiens (Human))
BDBM50265154
(CHEMBL521734 | N-cyclopropyl-3-(3-(cyclopropylmeth...)
Show SMILES Cc1ccc(cc1-c1ccc2c(c1)nnn(CC1CC1)c2=O)C(=O)NC1CC1
Show InChI InChI=1S/C22H22N4O2/c1-13-2-5-16(21(27)23-17-7-8-17)10-19(13)15-6-9-18-20(11-15)24-25-26(22(18)28)12-14-3-4-14/h2,5-6,9-11,14,17H,3-4,7-8,12H2,1H3,(H,23,27)
NCI pathway
Reactome pathway
n/an/a>2.00E+4n/an/an/an/an/an/a
GlaxoSmithKline R&D
Curated by ChEMBL
Assay Description
Inhibition of CDK2
Bioorg Med Chem Lett 18: 5285-9 (2008)
Article DOI: 10.1016/j.bmcl.2008.08.051
BindingDB Entry DOI: 10.7270/Q28K7B0R
Receptor protein-tyrosine kinase erbB-4
(Homo sapiens (Human))
BDBM50265154
(CHEMBL521734 | N-cyclopropyl-3-(3-(cyclopropylmeth...)
Show SMILES Cc1ccc(cc1-c1ccc2c(c1)nnn(CC1CC1)c2=O)C(=O)NC1CC1
Show InChI InChI=1S/C22H22N4O2/c1-13-2-5-16(21(27)23-17-7-8-17)10-19(13)15-6-9-18-20(11-15)24-25-26(22(18)28)12-14-3-4-14/h2,5-6,9-11,14,17H,3-4,7-8,12H2,1H3,(H,23,27)
n/an/a>2.50E+4n/an/an/an/an/an/a
GlaxoSmithKline R&D
Curated by ChEMBL
Assay Description
Inhibition of ErbB4
Bioorg Med Chem Lett 18: 5285-9 (2008)
Article DOI: 10.1016/j.bmcl.2008.08.051
BindingDB Entry DOI: 10.7270/Q28K7B0R