BDBM50265212 5-(4-((4-nitrophenoxy)methyl)benzylidene)pyrimidine-2,4,6(1H,3H,5H)-trione::CHEMBL496729
SMILES: [#8-]-[#7+](=O)-c1ccc(-[#8]-[#6]-[#6]-[#8]-c2ccc(\[#6]=[#6]-3\[#6](=O)-[#7]-[#6](=O)-[#7]-[#6]-3=O)cc2)cc1
InChI Key: InChIKey=TWWWKARYNOLSAO-UHFFFAOYSA-N
Data: 1 IC50
Activity Spreadsheet -- Enzyme Inhibition Constant Data from BindingDB
Found 1 hit for monomerid = 50265212
Trg + Lig
Ki
nM
ΔG°
kcal/mole
IC50
nM
Kd
nM
EC50/IC50
nM
koff
s-1
kon
M-1s-1
pHTemp
°C
Peroxisome proliferator-activated receptor gamma
(Mus musculus)
BDBM50265212
(5-(4-((4-nitrophenoxy)methyl)benzylidene)pyrimidin...)
Show SMILES [#8-]-[#7+](=O)-c1ccc(-[#8]-[#6]-[#6]-[#8]-c2ccc(\[#6]=[#6]-3\[#6](=O)-[#7]-[#6](=O)-[#7]-[#6]-3=O)cc2)cc1
Show InChI InChI=1S/C19H15N3O7/c23-17-16(18(24)21-19(25)20-17)11-12-1-5-14(6-2-12)28-9-10-29-15-7-3-13(4-8-15)22(26)27/h1-8,11H,9-10H2,(H2,20,21,23,24,25)
Reactome pathway
n/an/a 2.50E+3n/an/an/an/an/an/a
National Institute of Pharmaceutical Education and Research
Curated by ChEMBL
Assay Description
Displacement of [3H]rosiglitazone from mouse PPARgamma receptor by scintillation proximation assay
Bioorg Med Chem Lett 18: 4959-62 (2008)
Article DOI: 10.1016/j.bmcl.2008.08.028
BindingDB Entry DOI: 10.7270/Q2X066VZ