BDBM50265213 5-(4-((4-methoxyphenoxy)methyl)benzylidene)pyrimidine-2,4,6(1H,3H,5H)-trione::CHEMBL523593
SMILES: [#6]-[#8]-c1ccc(-[#8]-[#6]-[#6]-[#8]-c2ccc(\[#6]=[#6]-3\[#6](=O)-[#7]-[#6](=O)-[#7]-[#6]-3=O)cc2)cc1
InChI Key: InChIKey=WIFGHZAYPZRZHP-UHFFFAOYSA-N
Data: 1 IC50
Activity Spreadsheet -- Enzyme Inhibition Constant Data from BindingDB
Found 1 hit for monomerid = 50265213
Trg + Lig
Ki
nM
ΔG°
kcal/mole
IC50
nM
Kd
nM
EC50/IC50
nM
koff
s-1
kon
M-1s-1
pHTemp
°C
Peroxisome proliferator-activated receptor gamma
(Mus musculus)
BDBM50265213
(5-(4-((4-methoxyphenoxy)methyl)benzylidene)pyrimid...)
Show SMILES [#6]-[#8]-c1ccc(-[#8]-[#6]-[#6]-[#8]-c2ccc(\[#6]=[#6]-3\[#6](=O)-[#7]-[#6](=O)-[#7]-[#6]-3=O)cc2)cc1
Show InChI InChI=1S/C20H18N2O6/c1-26-14-6-8-16(9-7-14)28-11-10-27-15-4-2-13(3-5-15)12-17-18(23)21-20(25)22-19(17)24/h2-9,12H,10-11H2,1H3,(H2,21,22,23,24,25)
Reactome pathway
n/an/a 200n/an/an/an/an/an/a
National Institute of Pharmaceutical Education and Research
Curated by ChEMBL
Assay Description
Displacement of [3H]rosiglitazone from mouse PPARgamma receptor by scintillation proximation assay
Bioorg Med Chem Lett 18: 4959-62 (2008)
Article DOI: 10.1016/j.bmcl.2008.08.028
BindingDB Entry DOI: 10.7270/Q2X066VZ