BDBM50265238 3-(3-(4-((4-(2-chloro-5-((2S,3R,4R,5S,6R)-3,4,5-trihydroxy-6-(hydroxymethyl)tetrahydro-2H-pyran-2-yl)benzyl)phenoxy)methyl)benzylamino)-3-oxopropyl)-5,5-difluoro-7,9-dimethyl-5H-dipyrrolo[1,2-c:1',2'-f][1,3,2]diazaborinin-4-ium-5-uide::CHEMBL448655
SMILES: Cc1cc(C)n2c1C=C1C=CC(CCC(=O)NCc3ccc(COc4ccc(Cc5cc(ccc5Cl)[C@@H]5O[C@H](CO)[C@@H](O)[C@H](O)[C@H]5O)cc4)cc3)=[N+]1[B-]2(F)F
InChI Key: InChIKey=PKCOXSSKKYPYMF-REIISCNKSA-N
Data: 1 IC50
Activity Spreadsheet -- Enzyme Inhibition Constant Data from BindingDB
Found 1 hit for monomerid = 50265238
Trg + Lig
Ki
nM
ΔG°
kcal/mole
IC50
nM
Kd
nM
EC50/IC50
nM
koff
s-1
kon
M-1s-1
pHTemp
°C
Sodium/glucose cotransporter 2
(Homo sapiens (Human))
BDBM50265238
(3-(3-(4-((4-(2-chloro-5-((2S,3R,4R,5S,6R)-3,4,5-tr...)
Show SMILES Cc1cc(C)n2c1C=C1C=CC(CCC(=O)NCc3ccc(COc4ccc(Cc5cc(ccc5Cl)[C@@H]5O[C@H](CO)[C@@H](O)[C@H](O)[C@H]5O)cc4)cc3)=[N+]1[B-]2(F)F |r,c:10,55,t:8|
Show InChI InChI=1S/C41H43BClF2N3O7/c1-24-17-25(2)47-35(24)20-32-11-10-31(48(32)42(47,44)45)12-16-37(50)46-21-27-3-5-28(6-4-27)23-54-33-13-7-26(8-14-33)18-30-19-29(9-15-34(30)43)41-40(53)39(52)38(51)36(22-49)55-41/h3-11,13-15,17,19-20,36,38-41,49,51-53H,12,16,18,21-23H2,1-2H3,(H,46,50)/t36-,38-,39+,40-,41+/m1/s1
n/an/a 123n/an/an/an/an/an/a
Pfizer Global Research and Development
Curated by ChEMBL
Assay Description
Inhibition of human SGLT2 expressed in CHO cells assessed as [14C]-alpha-methyl-D-glucopyranoside uptake by fluorescence polarization assay
Bioorg Med Chem Lett 18: 4944-7 (2008)
Article DOI: 10.1016/j.bmcl.2008.08.036
BindingDB Entry DOI: 10.7270/Q27944J7