BDBM50265240 4-(4-iodophenoxy)thieno[2,3-c]pyridin-2-amine::CHEMBL526374
SMILES: Nc1cc2c(Oc3ccc(I)cc3)cncc2s1
InChI Key: InChIKey=MWZJHNYKHQGLSE-UHFFFAOYSA-N
Data: 1 IC50
Activity Spreadsheet -- Enzyme Inhibition Constant Data from BindingDB
Found 1 hit for monomerid = 50265240
Trg + Lig
Ki
nM
ΔG°
kcal/mole
IC50
nM
Kd
nM
EC50/IC50
nM
koff
s-1
kon
M-1s-1
pHTemp
°C
Mitogen-activated protein kinase kinase kinase 8
(Homo sapiens (Human))
BDBM50265240
(4-(4-iodophenoxy)thieno[2,3-c]pyridin-2-amine | CH...)
Show SMILES Nc1cc2c(Oc3ccc(I)cc3)cncc2s1
Show InChI InChI=1S/C13H9IN2OS/c14-8-1-3-9(4-2-8)17-11-6-16-7-12-10(11)5-13(15)18-12/h1-7H,15H2
NCI pathway
Reactome pathway
n/an/a>5.00E+4n/an/an/an/an/an/a
Abbott Bioresearch Center
Curated by ChEMBL
Assay Description
Inhibition of human recombinant COT by HTRF-based assay
Bioorg Med Chem Lett 18: 4952-5 (2008)
Article DOI: 10.1016/j.bmcl.2008.08.037
BindingDB Entry DOI: 10.7270/Q23J3CTH