BDBM50265351 4'-(2-(2H-tetrazol-5-yl)thieno[2,3-c]pyridin-4-yloxy)biphenyl-4-carbonitrile::CHEMBL497792
SMILES: N#Cc1ccc(cc1)-c1ccc(Oc2cncc3sc(cc23)-c2nnn[nH]2)cc1
InChI Key: InChIKey=DHUCGZMQSPCMBF-UHFFFAOYSA-N
Data: 2 IC50
Activity Spreadsheet -- Enzyme Inhibition Constant Data from BindingDB
Found 2 hits for monomerid = 50265351
Trg + Lig
Ki
nM
ΔG°
kcal/mole
IC50
nM
Kd
nM
EC50/IC50
nM
koff
s-1
kon
M-1s-1
pHTemp
°C
Dual specificity mitogen-activated protein kinase kinase 1
(Homo sapiens (Human))
BDBM50265351
(4'-(2-(2H-tetrazol-5-yl)thieno[2,3-c]pyridin-4-ylo...)
Show SMILES N#Cc1ccc(cc1)-c1ccc(Oc2cncc3sc(cc23)-c2nnn[nH]2)cc1
Show InChI InChI=1S/C21H12N6OS/c22-10-13-1-3-14(4-2-13)15-5-7-16(8-6-15)28-18-11-23-12-20-17(18)9-19(29-20)21-24-26-27-25-21/h1-9,11-12H,(H,24,25,26,27)
Reactome pathway
n/an/a 2.12E+4n/an/an/an/an/an/a
Abbott Bioresearch Center
Curated by ChEMBL
Assay Description
Inhibition of MEK1 (unknown origin) by HTRF assay
Bioorg Med Chem Lett 18: 4952-5 (2008)
Article DOI: 10.1016/j.bmcl.2008.08.037
BindingDB Entry DOI: 10.7270/Q23J3CTH
Mitogen-activated protein kinase kinase kinase 8
(Homo sapiens (Human))
BDBM50265351
(4'-(2-(2H-tetrazol-5-yl)thieno[2,3-c]pyridin-4-ylo...)
Show SMILES N#Cc1ccc(cc1)-c1ccc(Oc2cncc3sc(cc23)-c2nnn[nH]2)cc1
Show InChI InChI=1S/C21H12N6OS/c22-10-13-1-3-14(4-2-13)15-5-7-16(8-6-15)28-18-11-23-12-20-17(18)9-19(29-20)21-24-26-27-25-21/h1-9,11-12H,(H,24,25,26,27)
NCI pathway
Reactome pathway
n/an/a 310n/an/an/an/an/an/a
Abbott Bioresearch Center
Curated by ChEMBL
Assay Description
Inhibition of human recombinant COT by HTRF-based assay
Bioorg Med Chem Lett 18: 4952-5 (2008)
Article DOI: 10.1016/j.bmcl.2008.08.037
BindingDB Entry DOI: 10.7270/Q23J3CTH