BDBM50265366 (E)-1-morpholino-3-(4-(2-(thiophen-2-ylmethoxy)phenylthio)-2,3-bis(trifluoromethyl)phenyl)prop-2-en-1-one::CHEMBL496106
SMILES: FC(F)(F)c1c(Sc2ccccc2OCc2cccs2)ccc(\C=C\C(=O)N2CCOCC2)c1C(F)(F)F
InChI Key: InChIKey=PQEXIWGLHFOPDT-CSKARUKUSA-N
Data: 1 IC50
Activity Spreadsheet -- Enzyme Inhibition Constant Data from BindingDB
Found 1 hit for monomerid = 50265366
Trg + Lig
Ki
nM
ΔG°
kcal/mole
IC50
nM
Kd
nM
EC50/IC50
nM
koff
s-1
kon
M-1s-1
pHTemp
°C
Integrin alpha-L/beta-2 (LFA-1)
(Homo sapiens (Human))
BDBM50265366
((E)-1-morpholino-3-(4-(2-(thiophen-2-ylmethoxy)phe...)
Show SMILES FC(F)(F)c1c(Sc2ccccc2OCc2cccs2)ccc(\C=C\C(=O)N2CCOCC2)c1C(F)(F)F
Show InChI InChI=1S/C26H21F6NO3S2/c27-25(28,29)23-17(8-10-22(34)33-11-13-35-14-12-33)7-9-21(24(23)26(30,31)32)38-20-6-2-1-5-19(20)36-16-18-4-3-15-37-18/h1-10,15H,11-14,16H2/b10-8+
NCI pathway
Reactome pathway
n/an/a 11n/an/an/an/an/an/a
Biogen Idec Inc.
Curated by ChEMBL
Assay Description
Inhibition of recombinant LFA1/ICAM1-IG interaction (unknown origin) by time-resolved fluorimetry method
Bioorg Med Chem Lett 18: 5245-8 (2008)
Article DOI: 10.1016/j.bmcl.2008.08.062
BindingDB Entry DOI: 10.7270/Q23B5ZZ1