null
SMILES: CCOc1cc(=O)n(C)cc1-c1cc(NS(=O)(=O)CC)ccc1Oc1ccc(F)cc1F
InChI Key: InChIKey=GLXOAGUUYVCIFE-UHFFFAOYSA-N
Activity Spreadsheet -- Enzyme Inhibition Constant Data from BindingDB
Found 2 hits for monomerid = 50265625
Trg + Lig
Ki
nM
ΔG°
kcal/mole
IC50
nM
Kd
nM
EC50/IC50
nM
koff
s-1
kon
M-1s-1
pHTemp
°C
Bromodomain-containing protein 4
(Homo sapiens (Human))
BDBM50265625
(CHEMBL4082889)
Show SMILES CCOc1cc(=O)n(C)cc1-c1cc(NS(=O)(=O)CC)ccc1Oc1ccc(F)cc1F
Show InChI InChI=1S/C22H22F2N2O5S/c1-4-30-21-12-22(27)26(3)13-17(21)16-11-15(25-32(28,29)5-2)7-9-19(16)31-20-8-6-14(23)10-18(20)24/h6-13,25H,4-5H2,1-3H3
5.10n/an/an/an/an/an/an/an/a
AbbVie Inc.
Curated by ChEMBL
Assay Description
Inhibition of human N-terminal His6-tagged BRD4 BD1-BD2 (57 to 550 residues) expressed in EScherichia coli BL21(DE3) after 1 hr by Alexa-647-conjugat...
J Med Chem 60: 3828-3850 (2017)
Article DOI: 10.1021/acs.jmedchem.7b00017
BindingDB Entry DOI: 10.7270/Q2BR8VPN
Bromodomain-containing protein 4
(Homo sapiens (Human))
BDBM50265625
(CHEMBL4082889)
Show SMILES CCOc1cc(=O)n(C)cc1-c1cc(NS(=O)(=O)CC)ccc1Oc1ccc(F)cc1F
Show InChI InChI=1S/C22H22F2N2O5S/c1-4-30-21-12-22(27)26(3)13-17(21)16-11-15(25-32(28,29)5-2)7-9-19(16)31-20-8-6-14(23)10-18(20)24/h6-13,25H,4-5H2,1-3H3
n/an/an/an/a 39n/an/an/an/a
AbbVie Inc.
Curated by ChEMBL
Assay Description
Inhibition of BRD4 in human NCI-H1299 cells after 24 hrs by Bright-Glo luciferase reporter gene assay
J Med Chem 60: 3828-3850 (2017)
Article DOI: 10.1021/acs.jmedchem.7b00017
BindingDB Entry DOI: 10.7270/Q2BR8VPN