BDBM50265637 CHEMBL4073279
SMILES: CCS(=O)(=O)Nc1ccc2Oc3ccc(Cl)cc3CCCCOc3cc(=O)n(C)cc3-c2c1
InChI Key: InChIKey=ZZIGYCDFBKLWSO-UHFFFAOYSA-N
Data: 1 KI  1 EC50
Activity Spreadsheet -- Enzyme Inhibition Constant Data from BindingDB
Found 2 hits for monomerid = 50265637
Trg + Lig
Ki
nM
ΔG°
kcal/mole
IC50
nM
Kd
nM
EC50/IC50
nM
koff
s-1
kon
M-1s-1
pHTemp
°C
Bromodomain-containing protein 4
(Homo sapiens (Human))
BDBM50265637
(CHEMBL4073279)
Show SMILES CCS(=O)(=O)Nc1ccc2Oc3ccc(Cl)cc3CCCCOc3cc(=O)n(C)cc3-c2c1
Show InChI InChI=1S/C24H25ClN2O5S/c1-3-33(29,30)26-18-8-10-22-19(13-18)20-15-27(2)24(28)14-23(20)31-11-5-4-6-16-12-17(25)7-9-21(16)32-22/h7-10,12-15,26H,3-6,11H2,1-2H3
1.5n/an/an/an/an/an/an/an/a
AbbVie Inc.
Curated by ChEMBL
Assay Description
Inhibition of human N-terminal His6-tagged BRD4 BD1-BD2 (57 to 550 residues) expressed in EScherichia coli BL21(DE3) after 1 hr by Alexa-647-conjugat...
J Med Chem 60: 3828-3850 (2017)
Article DOI: 10.1021/acs.jmedchem.7b00017
BindingDB Entry DOI: 10.7270/Q2BR8VPN
Bromodomain-containing protein 4
(Homo sapiens (Human))
BDBM50265637
(CHEMBL4073279)
Show SMILES CCS(=O)(=O)Nc1ccc2Oc3ccc(Cl)cc3CCCCOc3cc(=O)n(C)cc3-c2c1
Show InChI InChI=1S/C24H25ClN2O5S/c1-3-33(29,30)26-18-8-10-22-19(13-18)20-15-27(2)24(28)14-23(20)31-11-5-4-6-16-12-17(25)7-9-21(16)32-22/h7-10,12-15,26H,3-6,11H2,1-2H3
n/an/an/an/a 5.10n/an/an/an/a
AbbVie Inc.
Curated by ChEMBL
Assay Description
Inhibition of BRD4 in human NCI-H1299 cells after 24 hrs by Bright-Glo luciferase reporter gene assay
J Med Chem 60: 3828-3850 (2017)
Article DOI: 10.1021/acs.jmedchem.7b00017
BindingDB Entry DOI: 10.7270/Q2BR8VPN