BDBM50265673 CHEMBL4068611
SMILES: Cn1cc(cn1)S(=O)(=O)N1CCC2=Cc3c(C[C@@]2(C1)C(=O)c1cc(ccn1)C(F)(F)F)cnn3-c1ccc(F)cc1
InChI Key: InChIKey=WANIDIGFXJFFEL-SANMLTNESA-N
Data: 4 KI  8 IC50  2 EC50
Activity Spreadsheet -- Enzyme Inhibition Constant Data from BindingDB
Found 14 hits for monomerid = 50265673
Trg + Lig
Ki
nM
ΔG°
kcal/mole
IC50
nM
Kd
nM
EC50/IC50
nM
koff
s-1
kon
M-1s-1
pHTemp
°C
Glucocorticoid receptor
(Homo sapiens (Human))
BDBM50265673
(CHEMBL4068611)
Show SMILES Cn1cc(cn1)S(=O)(=O)N1CCC2=Cc3c(C[C@@]2(C1)C(=O)c1cc(ccn1)C(F)(F)F)cnn3-c1ccc(F)cc1 |r,t:13|
Show InChI InChI=1S/C27H22F4N6O3S/c1-35-15-22(14-33-35)41(39,40)36-9-7-18-11-24-17(13-34-37(24)21-4-2-20(28)3-5-21)12-26(18,16-36)25(38)23-10-19(6-8-32-23)27(29,30)31/h2-6,8,10-11,13-15H,7,9,12,16H2,1H3/t26-/m0/s1
7.20n/an/an/an/an/an/an/an/a
Corcept Therapeutics
Curated by ChEMBL
Assay Description
Antagonist activity at glucocorticoid receptor in human HepG2 cells assessed as inhibition of dexamethasone-induced tyrosine amino transferase activi...
J Med Chem 60: 3405-3421 (2017)
Article DOI: 10.1021/acs.jmedchem.7b00162
BindingDB Entry DOI: 10.7270/Q27083X5
Glucocorticoid receptor
(RAT)
BDBM50265673
(CHEMBL4068611)
Show SMILES Cn1cc(cn1)S(=O)(=O)N1CCC2=Cc3c(C[C@@]2(C1)C(=O)c1cc(ccn1)C(F)(F)F)cnn3-c1ccc(F)cc1 |r,t:13|
Show InChI InChI=1S/C27H22F4N6O3S/c1-35-15-22(14-33-35)41(39,40)36-9-7-18-11-24-17(13-34-37(24)21-4-2-20(28)3-5-21)12-26(18,16-36)25(38)23-10-19(6-8-32-23)27(29,30)31/h2-6,8,10-11,13-15H,7,9,12,16H2,1H3/t26-/m0/s1
12n/an/an/an/an/an/an/an/a
Corcept Therapeutics
Curated by ChEMBL
Assay Description
Antagonist activity at rat glucocorticoid receptor in primary hepatocytes assessed as dexamethasone-induced tyrosine amino transferase activity prein...
J Med Chem 60: 3405-3421 (2017)
Article DOI: 10.1021/acs.jmedchem.7b00162
BindingDB Entry DOI: 10.7270/Q27083X5
Glucocorticoid receptor
(Homo sapiens (Human))
BDBM50265673
(CHEMBL4068611)
Show SMILES Cn1cc(cn1)S(=O)(=O)N1CCC2=Cc3c(C[C@@]2(C1)C(=O)c1cc(ccn1)C(F)(F)F)cnn3-c1ccc(F)cc1 |r,t:13|
Show InChI InChI=1S/C27H22F4N6O3S/c1-35-15-22(14-33-35)41(39,40)36-9-7-18-11-24-17(13-34-37(24)21-4-2-20(28)3-5-21)12-26(18,16-36)25(38)23-10-19(6-8-32-23)27(29,30)31/h2-6,8,10-11,13-15H,7,9,12,16H2,1H3/t26-/m0/s1
81n/an/an/an/an/an/an/an/a
Corcept Therapeutics
Curated by ChEMBL
Assay Description
Antagonist activity at glucocorticoid receptor in human primary hepatocytes assessed as inhibition of dexamethasone-induced tyrosine amino transferas...
J Med Chem 60: 3405-3421 (2017)
Article DOI: 10.1021/acs.jmedchem.7b00162
BindingDB Entry DOI: 10.7270/Q27083X5
Glucocorticoid receptor
(Canis lupus familiaris)
BDBM50265673
(CHEMBL4068611)
Show SMILES Cn1cc(cn1)S(=O)(=O)N1CCC2=Cc3c(C[C@@]2(C1)C(=O)c1cc(ccn1)C(F)(F)F)cnn3-c1ccc(F)cc1 |r,t:13|
Show InChI InChI=1S/C27H22F4N6O3S/c1-35-15-22(14-33-35)41(39,40)36-9-7-18-11-24-17(13-34-37(24)21-4-2-20(28)3-5-21)12-26(18,16-36)25(38)23-10-19(6-8-32-23)27(29,30)31/h2-6,8,10-11,13-15H,7,9,12,16H2,1H3/t26-/m0/s1
>1.00E+4n/an/an/an/an/an/an/an/a
Corcept Therapeutics
Curated by ChEMBL
Assay Description
Antagonist activity at dog glucocorticoid receptor in primary hepatocytes assessed as dexamethasone-induced tyrosine amino transferase activity prein...
J Med Chem 60: 3405-3421 (2017)
Article DOI: 10.1021/acs.jmedchem.7b00162
BindingDB Entry DOI: 10.7270/Q27083X5
Cytochrome P450 2C9
(Homo sapiens (Human))
BDBM50265673
(CHEMBL4068611)
Show SMILES Cn1cc(cn1)S(=O)(=O)N1CCC2=Cc3c(C[C@@]2(C1)C(=O)c1cc(ccn1)C(F)(F)F)cnn3-c1ccc(F)cc1 |r,t:13|
Show InChI InChI=1S/C27H22F4N6O3S/c1-35-15-22(14-33-35)41(39,40)36-9-7-18-11-24-17(13-34-37(24)21-4-2-20(28)3-5-21)12-26(18,16-36)25(38)23-10-19(6-8-32-23)27(29,30)31/h2-6,8,10-11,13-15H,7,9,12,16H2,1H3/t26-/m0/s1
Reactome pathway
n/an/a 2.00E+3n/an/an/an/an/an/a
Corcept Therapeutics
Curated by ChEMBL
Assay Description
Inhibition of CYP2C9 (unknown origin)
J Med Chem 60: 3405-3421 (2017)
Article DOI: 10.1021/acs.jmedchem.7b00162
BindingDB Entry DOI: 10.7270/Q27083X5
Cytochrome P450 3A4
(Homo sapiens (Human))
BDBM50265673
(CHEMBL4068611)
Show SMILES Cn1cc(cn1)S(=O)(=O)N1CCC2=Cc3c(C[C@@]2(C1)C(=O)c1cc(ccn1)C(F)(F)F)cnn3-c1ccc(F)cc1 |r,t:13|
Show InChI InChI=1S/C27H22F4N6O3S/c1-35-15-22(14-33-35)41(39,40)36-9-7-18-11-24-17(13-34-37(24)21-4-2-20(28)3-5-21)12-26(18,16-36)25(38)23-10-19(6-8-32-23)27(29,30)31/h2-6,8,10-11,13-15H,7,9,12,16H2,1H3/t26-/m0/s1
Reactome pathway
n/an/a 1.30E+3n/an/an/an/an/an/a
Corcept Therapeutics
Curated by ChEMBL
Assay Description
Inhibition of CYP3A4 (unknown origin)
J Med Chem 60: 3405-3421 (2017)
Article DOI: 10.1021/acs.jmedchem.7b00162
BindingDB Entry DOI: 10.7270/Q27083X5
Cytochrome P450 3A5 (CYP3A5)
(Homo sapiens (Human))
BDBM50265673
(CHEMBL4068611)
Show SMILES Cn1cc(cn1)S(=O)(=O)N1CCC2=Cc3c(C[C@@]2(C1)C(=O)c1cc(ccn1)C(F)(F)F)cnn3-c1ccc(F)cc1 |r,t:13|
Show InChI InChI=1S/C27H22F4N6O3S/c1-35-15-22(14-33-35)41(39,40)36-9-7-18-11-24-17(13-34-37(24)21-4-2-20(28)3-5-21)12-26(18,16-36)25(38)23-10-19(6-8-32-23)27(29,30)31/h2-6,8,10-11,13-15H,7,9,12,16H2,1H3/t26-/m0/s1
n/an/a 4.90E+3n/an/an/an/an/an/a
Corcept Therapeutics
Curated by ChEMBL
Assay Description
Inhibition of CYP3A5 (unknown origin)
J Med Chem 60: 3405-3421 (2017)
Article DOI: 10.1021/acs.jmedchem.7b00162
BindingDB Entry DOI: 10.7270/Q27083X5
Cytochrome P450 1A
(Homo sapiens (Human))
BDBM50265673
(CHEMBL4068611)
Show SMILES Cn1cc(cn1)S(=O)(=O)N1CCC2=Cc3c(C[C@@]2(C1)C(=O)c1cc(ccn1)C(F)(F)F)cnn3-c1ccc(F)cc1 |r,t:13|
Show InChI InChI=1S/C27H22F4N6O3S/c1-35-15-22(14-33-35)41(39,40)36-9-7-18-11-24-17(13-34-37(24)21-4-2-20(28)3-5-21)12-26(18,16-36)25(38)23-10-19(6-8-32-23)27(29,30)31/h2-6,8,10-11,13-15H,7,9,12,16H2,1H3/t26-/m0/s1
Reactome pathway
n/an/a>1.00E+4n/an/an/an/an/an/a
Corcept Therapeutics
Curated by ChEMBL
Assay Description
Inhibition of CYP1A2 (unknown origin)
J Med Chem 60: 3405-3421 (2017)
Article DOI: 10.1021/acs.jmedchem.7b00162
BindingDB Entry DOI: 10.7270/Q27083X5
Cytochrome P450 2B6
(Homo sapiens (Human))
BDBM50265673
(CHEMBL4068611)
Show SMILES Cn1cc(cn1)S(=O)(=O)N1CCC2=Cc3c(C[C@@]2(C1)C(=O)c1cc(ccn1)C(F)(F)F)cnn3-c1ccc(F)cc1 |r,t:13|
Show InChI InChI=1S/C27H22F4N6O3S/c1-35-15-22(14-33-35)41(39,40)36-9-7-18-11-24-17(13-34-37(24)21-4-2-20(28)3-5-21)12-26(18,16-36)25(38)23-10-19(6-8-32-23)27(29,30)31/h2-6,8,10-11,13-15H,7,9,12,16H2,1H3/t26-/m0/s1
n/an/a>1.00E+4n/an/an/an/an/an/a
Corcept Therapeutics
Curated by ChEMBL
Assay Description
Inhibition of CYP2B6 (unknown origin)
J Med Chem 60: 3405-3421 (2017)
Article DOI: 10.1021/acs.jmedchem.7b00162
BindingDB Entry DOI: 10.7270/Q27083X5
Cytochrome P450 2C8
(Homo sapiens (Human))
BDBM50265673
(CHEMBL4068611)
Show SMILES Cn1cc(cn1)S(=O)(=O)N1CCC2=Cc3c(C[C@@]2(C1)C(=O)c1cc(ccn1)C(F)(F)F)cnn3-c1ccc(F)cc1 |r,t:13|
Show InChI InChI=1S/C27H22F4N6O3S/c1-35-15-22(14-33-35)41(39,40)36-9-7-18-11-24-17(13-34-37(24)21-4-2-20(28)3-5-21)12-26(18,16-36)25(38)23-10-19(6-8-32-23)27(29,30)31/h2-6,8,10-11,13-15H,7,9,12,16H2,1H3/t26-/m0/s1
n/an/a 210n/an/an/an/an/an/a
Corcept Therapeutics
Curated by ChEMBL
Assay Description
Inhibition of CYP2C8 (unknown origin)
J Med Chem 60: 3405-3421 (2017)
Article DOI: 10.1021/acs.jmedchem.7b00162
BindingDB Entry DOI: 10.7270/Q27083X5
Cytochrome P450 2C19
(Homo sapiens (Human))
BDBM50265673
(CHEMBL4068611)
Show SMILES Cn1cc(cn1)S(=O)(=O)N1CCC2=Cc3c(C[C@@]2(C1)C(=O)c1cc(ccn1)C(F)(F)F)cnn3-c1ccc(F)cc1 |r,t:13|
Show InChI InChI=1S/C27H22F4N6O3S/c1-35-15-22(14-33-35)41(39,40)36-9-7-18-11-24-17(13-34-37(24)21-4-2-20(28)3-5-21)12-26(18,16-36)25(38)23-10-19(6-8-32-23)27(29,30)31/h2-6,8,10-11,13-15H,7,9,12,16H2,1H3/t26-/m0/s1
Reactome pathway
n/an/a 8.00E+3n/an/an/an/an/an/a
Corcept Therapeutics
Curated by ChEMBL
Assay Description
Inhibition of CYP2C19 (unknown origin)
J Med Chem 60: 3405-3421 (2017)
Article DOI: 10.1021/acs.jmedchem.7b00162
BindingDB Entry DOI: 10.7270/Q27083X5
Glucocorticoid receptor
(Canis lupus familiaris)
BDBM50265673
(CHEMBL4068611)
Show SMILES Cn1cc(cn1)S(=O)(=O)N1CCC2=Cc3c(C[C@@]2(C1)C(=O)c1cc(ccn1)C(F)(F)F)cnn3-c1ccc(F)cc1 |r,t:13|
Show InChI InChI=1S/C27H22F4N6O3S/c1-35-15-22(14-33-35)41(39,40)36-9-7-18-11-24-17(13-34-37(24)21-4-2-20(28)3-5-21)12-26(18,16-36)25(38)23-10-19(6-8-32-23)27(29,30)31/h2-6,8,10-11,13-15H,7,9,12,16H2,1H3/t26-/m0/s1
n/an/an/an/a>1.00E+4n/an/an/an/a
Corcept Therapeutics
Curated by ChEMBL
Assay Description
Agonist activity at dog glucocorticoid receptor in primary hepatocytes assessed as induction of tyrosine amino transferase activity measured after 20...
J Med Chem 60: 3405-3421 (2017)
Article DOI: 10.1021/acs.jmedchem.7b00162
BindingDB Entry DOI: 10.7270/Q27083X5
Glucocorticoid receptor
(RAT)
BDBM50265673
(CHEMBL4068611)
Show SMILES Cn1cc(cn1)S(=O)(=O)N1CCC2=Cc3c(C[C@@]2(C1)C(=O)c1cc(ccn1)C(F)(F)F)cnn3-c1ccc(F)cc1 |r,t:13|
Show InChI InChI=1S/C27H22F4N6O3S/c1-35-15-22(14-33-35)41(39,40)36-9-7-18-11-24-17(13-34-37(24)21-4-2-20(28)3-5-21)12-26(18,16-36)25(38)23-10-19(6-8-32-23)27(29,30)31/h2-6,8,10-11,13-15H,7,9,12,16H2,1H3/t26-/m0/s1
n/an/an/an/a>1.00E+4n/an/an/an/a
Corcept Therapeutics
Curated by ChEMBL
Assay Description
Agonist activity at rat glucocorticoid receptor in primary hepatocytes assessed as induction of tyrosine amino transferase activity measured after 20...
J Med Chem 60: 3405-3421 (2017)
Article DOI: 10.1021/acs.jmedchem.7b00162
BindingDB Entry DOI: 10.7270/Q27083X5
Cytochrome P450 2D6
(Homo sapiens (Human))
BDBM50265673
(CHEMBL4068611)
Show SMILES Cn1cc(cn1)S(=O)(=O)N1CCC2=Cc3c(C[C@@]2(C1)C(=O)c1cc(ccn1)C(F)(F)F)cnn3-c1ccc(F)cc1 |r,t:13|
Show InChI InChI=1S/C27H22F4N6O3S/c1-35-15-22(14-33-35)41(39,40)36-9-7-18-11-24-17(13-34-37(24)21-4-2-20(28)3-5-21)12-26(18,16-36)25(38)23-10-19(6-8-32-23)27(29,30)31/h2-6,8,10-11,13-15H,7,9,12,16H2,1H3/t26-/m0/s1
n/an/a 9.00E+3n/an/an/an/an/an/a
Corcept Therapeutics
Curated by ChEMBL
Assay Description
Inhibition of CYP2D6 (unknown origin)
J Med Chem 60: 3405-3421 (2017)
Article DOI: 10.1021/acs.jmedchem.7b00162
BindingDB Entry DOI: 10.7270/Q27083X5