BDBM50265745 4-Amino-6-(benzylamino)-3-(6-(4-methylpiperazin-1-yl)-1Hbenzo[ d]imidazol-2-yl)quinolin-2(1H)-one::CHEMBL495735
SMILES: CN1CCN(CC1)c1ccc2nc([nH]c2c1)-c1c(N)c2cc(NCc3ccccc3)ccc2[nH]c1=O
InChI Key: InChIKey=PWPWTOPEJWNZOA-UHFFFAOYSA-N
Data: 3 IC50
Activity Spreadsheet -- Enzyme Inhibition Constant Data from BindingDB
Found 3 hits for monomerid = 50265745
Trg + Lig
Ki
nM
ΔG°
kcal/mole
IC50
nM
Kd
nM
EC50/IC50
nM
koff
s-1
kon
M-1s-1
pHTemp
°C
Platelet-derived growth factor receptor beta
(Homo sapiens (Human))
BDBM50265745
(4-Amino-6-(benzylamino)-3-(6-(4-methylpiperazin-1-...)
Show SMILES CN1CCN(CC1)c1ccc2nc([nH]c2c1)-c1c(N)c2cc(NCc3ccccc3)ccc2[nH]c1=O
Show InChI InChI=1S/C28H29N7O/c1-34-11-13-35(14-12-34)20-8-10-23-24(16-20)32-27(31-23)25-26(29)21-15-19(7-9-22(21)33-28(25)36)30-17-18-5-3-2-4-6-18/h2-10,15-16,30H,11-14,17H2,1H3,(H,31,32)(H3,29,33,36)
NCI pathway
Reactome pathway
n/an/a 0.600n/an/an/an/an/an/a
Novartis Institutes for Biomedical Research
Curated by ChEMBL
Assay Description
Inhibition of human recombinant PDGFRbeta
J Med Chem 52: 278-92 (2009)
Article DOI: 10.1021/jm800790t
BindingDB Entry DOI: 10.7270/Q2TD9X7X
Fibroblast growth factor receptor 1
(Homo sapiens (Human))
BDBM50265745
(4-Amino-6-(benzylamino)-3-(6-(4-methylpiperazin-1-...)
Show SMILES CN1CCN(CC1)c1ccc2nc([nH]c2c1)-c1c(N)c2cc(NCc3ccccc3)ccc2[nH]c1=O
Show InChI InChI=1S/C28H29N7O/c1-34-11-13-35(14-12-34)20-8-10-23-24(16-20)32-27(31-23)25-26(29)21-15-19(7-9-22(21)33-28(25)36)30-17-18-5-3-2-4-6-18/h2-10,15-16,30H,11-14,17H2,1H3,(H,31,32)(H3,29,33,36)
NCI pathway
Reactome pathway
n/an/a 8n/an/an/an/an/an/a
Novartis Institutes for Biomedical Research
Curated by ChEMBL
Assay Description
Inhibition of human recombinant FGFR1
J Med Chem 52: 278-92 (2009)
Article DOI: 10.1021/jm800790t
BindingDB Entry DOI: 10.7270/Q2TD9X7X
Vascular endothelial growth factor receptor 2
(Homo sapiens (Human))
BDBM50265745
(4-Amino-6-(benzylamino)-3-(6-(4-methylpiperazin-1-...)
Show SMILES CN1CCN(CC1)c1ccc2nc([nH]c2c1)-c1c(N)c2cc(NCc3ccccc3)ccc2[nH]c1=O
Show InChI InChI=1S/C28H29N7O/c1-34-11-13-35(14-12-34)20-8-10-23-24(16-20)32-27(31-23)25-26(29)21-15-19(7-9-22(21)33-28(25)36)30-17-18-5-3-2-4-6-18/h2-10,15-16,30H,11-14,17H2,1H3,(H,31,32)(H3,29,33,36)
NCI pathway
Reactome pathway
n/an/a 21n/an/an/an/an/an/a
Novartis Institutes for Biomedical Research
Curated by ChEMBL
Assay Description
Inhibition of human recombinant VEGFR2
J Med Chem 52: 278-92 (2009)
Article DOI: 10.1021/jm800790t
BindingDB Entry DOI: 10.7270/Q2TD9X7X