BDBM50266067 CHEMBL4072423
SMILES: NC(CO)(CO)CO.C[C@@H](Oc1cc2oc(=O)n(CCC(O)=O)c2cc1Cl)c1cccc(C)n1
InChI Key: InChIKey=INZZWVUFFAHFNV-RFVHGSKJSA-N
Data: 2 IC50
Activity Spreadsheet -- Enzyme Inhibition Constant Data from BindingDB
Found 2 hits for monomerid = 50266067
Trg + Lig
Ki
nM
ΔG°
kcal/mole
IC50
nM
Kd
nM
EC50/IC50
nM
koff
s-1
kon
M-1s-1
pHTemp
°C
Kynurenine 3-monooxygenase
(Homo sapiens (Human))
BDBM50266067
(CHEMBL4072423)
Show SMILES NC(CO)(CO)CO.C[C@@H](Oc1cc2oc(=O)n(CCC(O)=O)c2cc1Cl)c1cccc(C)n1 |r|
Show InChI InChI=1S/C18H17ClN2O5.C4H11NO3/c1-10-4-3-5-13(20-10)11(2)25-15-9-16-14(8-12(15)19)21(18(24)26-16)7-6-17(22)23;5-4(1-6,2-7)3-8/h3-5,8-9,11H,6-7H2,1-2H3,(H,22,23);6-8H,1-3,5H2/t11-;/m1./s1
Reactome pathway
n/an/a 5n/an/an/an/an/an/a
GlaxoSmithKline
Curated by ChEMBL
Assay Description
Inhibition of full length human GST-tagged KMO expressed in baculovirus infected Sf9 insect cell membranes using kynurenine as substrate measured aft...
J Med Chem 60: 3383-3404 (2017)
Article DOI: 10.1021/acs.jmedchem.7b00055
BindingDB Entry DOI: 10.7270/Q26112SB
Kynurenine 3-monooxygenase
(Homo sapiens (Human))
BDBM50266067
(CHEMBL4072423)
Show SMILES NC(CO)(CO)CO.C[C@@H](Oc1cc2oc(=O)n(CCC(O)=O)c2cc1Cl)c1cccc(C)n1 |r|
Show InChI InChI=1S/C18H17ClN2O5.C4H11NO3/c1-10-4-3-5-13(20-10)11(2)25-15-9-16-14(8-12(15)19)21(18(24)26-16)7-6-17(22)23;5-4(1-6,2-7)3-8/h3-5,8-9,11H,6-7H2,1-2H3,(H,22,23);6-8H,1-3,5H2/t11-;/m1./s1
Reactome pathway
n/an/a 316n/an/an/an/an/an/a
GlaxoSmithKline
Curated by ChEMBL
Assay Description
Inhibition of full length human KMO expressed in HEK293 cells using kynurenine as substrate measured after 20 hrs by LC-MS/MS analysis
J Med Chem 60: 3383-3404 (2017)
Article DOI: 10.1021/acs.jmedchem.7b00055
BindingDB Entry DOI: 10.7270/Q26112SB