BDBM50266272 (S)-2-(4-bromophenoxy)-N-(2-oxotetrahydrofuran-3-yl)acetamide::CHEMBL512914
SMILES: Brc1ccc(OCC(=O)N[C@H]2CCOC2=O)cc1
InChI Key: InChIKey=PCRDLUUMELEJPB-JTQLQIEISA-N
Data: 2 IC50
Activity Spreadsheet -- Enzyme Inhibition Constant Data from BindingDB
Found 2 hits for monomerid = 50266272
Trg + Lig
Ki
nM
ΔG°
kcal/mole
IC50
nM
Kd
nM
EC50/IC50
nM
koff
s-1
kon
M-1s-1
pHTemp
°C
Transcriptional activator protein luxR
(Vibrio fischeri (strain ATCC 700601 / ES114))
BDBM50266272
((S)-2-(4-bromophenoxy)-N-(2-oxotetrahydrofuran-3-y...)
Show SMILES Brc1ccc(OCC(=O)N[C@H]2CCOC2=O)cc1 |r|
Show InChI InChI=1S/C12H12BrNO4/c13-8-1-3-9(4-2-8)18-7-11(15)14-10-5-6-17-12(10)16/h1-4,10H,5-7H2,(H,14,15)/t10-/m0/s1
n/an/a 3.00E+3n/an/an/an/an/an/a
University of Wisconsin-Madison
Curated by ChEMBL
Assay Description
Antagonist activity at Vibrio fischeri ES114 LuxR receptor assessed as inhibition of OHHL-induced response by luciferase reporter gene assay
Bioorg Med Chem Lett 18: 5978-81 (2008)
Article DOI: 10.1016/j.bmcl.2008.07.089
BindingDB Entry DOI: 10.7270/Q2Q81CXX
Transcriptional activator protein traR
(Rhizobium radiobacter)
BDBM50266272
((S)-2-(4-bromophenoxy)-N-(2-oxotetrahydrofuran-3-y...)
Show SMILES Brc1ccc(OCC(=O)N[C@H]2CCOC2=O)cc1 |r|
Show InChI InChI=1S/C12H12BrNO4/c13-8-1-3-9(4-2-8)18-7-11(15)14-10-5-6-17-12(10)16/h1-4,10H,5-7H2,(H,14,15)/t10-/m0/s1
n/an/a 510n/an/an/an/an/an/a
University of Wisconsin-Madison
Curated by ChEMBL
Assay Description
Antagonist activity at Agrobacterium tumefaciens WCF47 TraR receptor assessed as inhibition of OOHL-induced response by beta-galctosidase reporter ge...
Bioorg Med Chem Lett 18: 5978-81 (2008)
Article DOI: 10.1016/j.bmcl.2008.07.089
BindingDB Entry DOI: 10.7270/Q2Q81CXX