BDBM50266273 15-chlorotajixanthone hydrate::CHEMBL458017
SMILES: CC(=C)[C@H]1COc2c(C)cc3oc4c(C[C@H](Cl)C(C)(C)O)ccc(O)c4c(=O)c3c2[C@@H]1O
InChI Key: InChIKey=DQHHJZQNNVLSOI-DAESXHAQSA-N
Data: 1 IC50
Activity Spreadsheet -- Enzyme Inhibition Constant Data from BindingDB
Found 1 hit for monomerid = 50266273
Trg + Lig
Ki
nM
ΔG°
kcal/mole
IC50
nM
Kd
nM
EC50/IC50
nM
koff
s-1
kon
M-1s-1
pHTemp
°C
Calmodulin
(Homo sapiens (Human))
BDBM50266273
(15-chlorotajixanthone hydrate | CHEMBL458017)
Show SMILES CC(=C)[C@H]1COc2c(C)cc3oc4c(C[C@H](Cl)C(C)(C)O)ccc(O)c4c(=O)c3c2[C@@H]1O |r|
Show InChI InChI=1S/C25H27ClO6/c1-11(2)14-10-31-23-12(3)8-16-19(20(23)21(14)28)22(29)18-15(27)7-6-13(24(18)32-16)9-17(26)25(4,5)30/h6-8,14,17,21,27-28,30H,1,9-10H2,2-5H3/t14-,17+,21-/m1/s1
NCI pathway
Reactome pathway
n/an/a 9.59E+3n/an/an/an/an/an/a
Universidad Nacional Autónoma de México
Curated by ChEMBL
Assay Description
Inhibition of recombinant calmodulin (unknown origin) mediated bovine brain PDE1 activation assessed as effect on inorganic phosphate release by spec...
Bioorg Med Chem 17: 2167-74 (2009)
Article DOI: 10.1016/j.bmc.2008.10.079
BindingDB Entry DOI: 10.7270/Q2V124NN