BDBM50266292 CHEMBL3906203
SMILES: Cc1cc2n(C)c(=O)n(C)c2cc1N1C(=O)c2cccc3cccc(C1=O)c23
InChI Key: InChIKey=WNTOXMAGPDYDCR-UHFFFAOYSA-N
Data: 2 IC50
PDB links: 1 PDB ID matches this monomer.
Activity Spreadsheet -- Enzyme Inhibition Constant Data from BindingDB
Found 2 hits for monomerid = 50266292
Trg + Lig
Ki
nM
ΔG°
kcal/mole
IC50
nM
Kd
nM
EC50/IC50
nM
koff
s-1
kon
M-1s-1
pHTemp
°C
CREB-binding protein
(Homo sapiens (Human))
BDBM50266292
(CHEMBL3906203)
Show SMILES Cc1cc2n(C)c(=O)n(C)c2cc1N1C(=O)c2cccc3cccc(C1=O)c23
Show InChI InChI=1S/C22H17N3O3/c1-12-10-17-18(24(3)22(28)23(17)2)11-16(12)25-20(26)14-8-4-6-13-7-5-9-15(19(13)14)21(25)27/h4-11H,1-3H3
Reactome pathway
n/an/a 324n/an/an/an/an/an/a
University of Oxford
Curated by ChEMBL
Cancer Res 75: 5106-5119 (2015)
3D
3D Structure (crystal)
Bromodomain-containing protein 4
(Homo sapiens (Human))
BDBM50266292
(CHEMBL3906203)
Show SMILES Cc1cc2n(C)c(=O)n(C)c2cc1N1C(=O)c2cccc3cccc(C1=O)c23
Show InChI InChI=1S/C22H17N3O3/c1-12-10-17-18(24(3)22(28)23(17)2)11-16(12)25-20(26)14-8-4-6-13-7-5-9-15(19(13)14)21(25)27/h4-11H,1-3H3
n/an/a 2.46E+3n/an/an/an/an/an/a
University of Oxford
Curated by ChEMBL
Cancer Res 75: 5106-5119 (2015)